{"text_format":"1","workbook":"xlsx","n_sheets":12,"sheets":["Simulador CEF","Proposta 1 Via","Premissas e Calculos","Apoio","Meses","fluxos","DADOS DOS EMPREENDIMENTOS","Avaliações Por Unidades","Plan1","Plan2","Plan3","Plan4"],"not_rendered":{"charts":0,"images":0,"macros":1,"external_links":0,"defined_names":30,"comments":1,"pivot_tables":0},"unopened":[],"bounds":{"document_bytes":16777216,"sheet_cells":100000,"rows_first":2000,"rows_last":500,"rows_between":2000,"halvings":0,"cell_chars":16384,"cell_head_chars":4096},"cells_cut":0,"cells_raw":0,"read":"whole","date_system":"1900"}

{"sheet":"Simulador CEF","index":0,"n_rows":239,"n_cols":256,"rows_kept":239,"cut":false,"hidden":false,"merged":[[136,1,137,1],[136,10,137,12],[132,11,133,15],[132,5,133,10],[113,2,117,3],[62,1,97,2],[89,6,89,9],[91,6,91,9],[94,4,94,9],[91,10,91,11],[96,12,96,14],[118,9,120,12],[124,1,126,22],[93,10,94,11],[99,1,103,3],[93,3,94,3],[109,1,111,22],[94,15,94,17],[93,15,93,17],[118,17,120,17],[118,2,120,3],[77,18,77,20],[91,15,91,17],[89,15,89,17],[196,18,196,19],[194,18,194,19],[195,18,195,19],[190,18,190,19],[185,18,185,19],[176,18,176,19],[188,18,188,19],[168,14,168,15],[193,18,193,19],[182,18,182,19],[181,18,181,19],[191,18,191,19],[169,16,169,17],[180,18,180,19],[178,18,178,19],[177,16,177,17],[173,16,173,17],[170,16,170,17],[169,14,169,15],[168,16,168,17],[183,18,183,19],[186,18,186,19],[192,18,192,19],[189,18,189,19],[180,16,180,17],[159,16,159,17],[158,14,158,15],[159,14,159,15],[185,14,185,15],[185,16,185,17],[179,16,179,17],[178,16,178,17],[131,42,132,44],[173,18,173,19],[131,32,132,35],[131,37,132,41],[166,18,166,19],[158,18,158,19],[169,18,169,19],[170,18,170,19],[171,18,171,19],[172,18,172,19],[161,18,161,19],[160,18,160,19],[154,18,155,19],[157,18,157,19],[159,18,159,19],[162,18,162,19],[167,18,167,19],[187,18,187,19],[175,18,175,19],[184,18,184,19],[179,18,179,19],[174,18,174,19],[165,18,165,19],[177,18,177,19],[164,18,164,19],[168,18,168,19],[164,6,164,8],[160,9,160,11],[162,9,162,11],[154,9,155,11],[161,16,161,17],[154,6,155,8],[158,6,158,8],[157,12,157,13],[113,9,117,12],[159,12,159,13],[158,12,158,13],[161,12,161,13],[164,14,164,15],[164,12,164,13],[163,16,163,17],[162,14,162,15],[162,16,162,17],[160,16,160,17],[160,14,160,15],[161,14,161,15],[164,16,164,17],[162,12,162,13],[163,14,163,15],[157,14,157,15],[145,39,147,41],[142,2,144,23],[136,6,137,9],[96,31,96,33],[97,18,97,20],[157,6,157,8],[158,9,158,11],[154,14,155,15],[157,9,157,11],[157,16,157,17],[95,21,97,21],[118,5,120,8],[113,5,117,8],[129,11,131,15],[158,16,158,17],[109,31,111,52],[113,35,117,38],[118,35,119,38],[128,32,130,35],[128,42,130,44],[118,32,119,33],[128,37,130,41],[136,2,137,3],[148,40,149,41],[163,6,163,8],[160,12,160,13],[163,12,163,13],[96,19,96,20],[159,9,159,11],[161,9,161,11],[154,5,155,5],[154,12,155,13],[152,16,153,17],[160,6,160,8],[163,9,163,11],[161,6,161,8],[163,18,163,19],[159,6,159,8],[129,5,131,10],[101,5,102,15],[96,15,96,17],[95,4,96,9],[118,18,120,20],[118,13,120,16],[97,4,97,9],[116,54,118,56],[113,39,117,42],[118,39,119,42],[119,60,120,62],[116,57,118,59],[118,48,119,50],[119,57,120,59],[118,43,119,46],[119,54,120,56],[113,43,117,46],[148,39,149,39],[90,253,90,255],[85,18,85,20],[91,31,91,33],[85,12,85,14],[89,12,89,14],[104,1,108,22],[113,32,117,33],[113,48,117,50],[113,18,117,20],[113,13,117,17],[95,19,95,20],[91,12,91,14],[89,10,89,11],[89,4,89,5],[87,6,87,9],[87,4,87,5],[87,10,87,11],[92,219,92,222],[91,4,91,5],[116,60,118,62],[85,4,85,5],[94,31,94,33],[93,31,93,33],[64,31,64,33],[68,31,68,33],[66,31,66,33],[75,18,75,20],[79,31,79,33],[83,15,83,17],[75,6,75,9],[79,15,79,17],[75,12,75,14],[68,12,68,14],[83,12,83,14],[77,31,77,33],[75,31,75,33],[66,18,66,20],[83,18,83,20],[81,18,81,20],[79,18,79,20],[81,31,81,33],[83,31,83,33],[68,15,68,17],[75,15,75,17],[77,15,77,17],[68,18,68,20],[66,15,66,17],[93,19,93,20],[91,18,91,20],[85,15,85,17],[87,15,87,17],[87,12,87,14],[87,18,87,20],[85,31,85,33],[87,31,87,33],[89,18,89,20],[89,31,89,33],[93,12,94,14],[40,12,40,14],[56,12,56,14],[42,12,42,14],[44,12,44,14],[58,12,58,14],[62,12,63,14],[63,31,63,33],[54,15,54,17],[43,15,43,16],[54,12,54,14],[62,15,63,17],[46,28,46,30],[48,28,48,30],[60,1,61,22],[35,1,59,2],[38,9,38,11],[40,6,40,8],[44,9,44,11],[41,9,41,11],[54,6,54,8],[56,6,56,8],[43,9,43,11],[43,7,43,8],[52,6,52,8],[36,28,36,30],[36,15,36,17],[38,28,38,30],[40,28,40,30],[43,28,43,29],[42,28,42,30],[44,28,44,30],[52,28,52,30],[64,18,64,20],[56,28,56,30],[41,28,41,29],[52,15,52,17],[44,15,44,17],[40,15,40,17],[64,15,64,17],[42,15,42,17],[41,15,41,16],[53,15,53,16],[53,28,53,29],[61,25,63,25],[58,28,58,30],[58,15,58,17],[56,15,56,17],[54,28,54,30],[11,236,11,237],[8,219,11,219],[19,13,19,16],[11,225,15,227],[31,18,31,20],[31,13,31,14],[19,5,19,8],[35,12,35,14],[36,9,36,11],[30,6,31,8],[35,15,35,17],[36,6,36,8],[35,6,35,8],[27,6,27,8],[27,18,27,20],[29,18,29,20],[25,18,25,20],[25,11,25,16],[23,15,23,16],[11,5,11,6],[36,12,36,14],[13,1,13,22],[19,1,19,4],[35,28,35,30],[23,18,23,20],[5,5,5,6],[11,8,11,11],[15,12,15,16],[23,8,25,8],[9,5,9,6],[29,2,29,12],[1,6,1,15],[0,6,0,15],[20,0,21,2],[18,9,23,12],[1,21,1,23],[2,21,2,23],[5,18,5,20],[3,219,3,222],[3,18,3,20],[7,5,7,6],[3,6,3,15],[5,21,5,23],[9,14,9,16],[7,219,7,222],[5,221,5,222],[9,8,9,11],[7,18,7,20],[7,8,7,11],[9,18,9,20],[5,8,5,11],[5,12,5,16],[42,4,42,5],[46,4,46,5],[44,4,44,5],[56,4,56,5],[40,9,40,11],[58,7,58,8],[178,12,178,13],[177,12,177,13],[181,12,181,13],[44,6,44,8],[85,10,85,11],[75,4,75,5],[75,10,75,11],[79,4,79,5],[85,6,85,9],[81,10,81,11],[83,4,83,5],[83,6,83,9],[83,10,83,11],[52,4,52,5],[178,6,178,8],[177,6,177,8],[179,9,179,11],[176,6,176,8],[41,12,41,13],[54,9,54,11],[43,12,43,13],[56,9,56,11],[52,12,52,14],[53,12,53,13],[42,9,42,11],[79,6,79,9],[79,10,79,11],[62,10,63,11],[46,6,46,8],[46,9,46,11],[46,12,46,14],[77,10,77,11],[64,10,64,11],[77,6,77,9],[68,10,68,11],[198,14,198,15],[186,14,186,15],[197,14,197,15],[174,14,174,15],[183,14,183,15],[209,14,209,15],[203,14,203,15],[204,14,204,15],[205,14,205,15],[206,14,206,15],[200,14,200,15],[202,14,202,15],[201,14,201,15],[208,14,208,15],[207,14,207,15],[175,14,175,15],[182,14,182,15],[179,14,179,15],[199,14,199,15],[188,14,188,15],[180,14,180,15],[196,14,196,15],[195,14,195,15],[187,14,187,15],[181,16,181,17],[178,14,178,15],[185,12,185,13],[173,6,173,8],[175,9,175,11],[173,9,173,11],[174,9,174,11],[175,12,175,13],[175,6,175,8],[174,6,174,8],[181,14,181,15],[184,14,184,15],[177,14,177,15],[173,14,173,15],[174,12,174,13],[176,14,176,15],[183,12,183,13],[179,12,179,13],[176,12,176,13],[184,16,184,17],[173,12,173,13],[184,12,184,13],[180,12,180,13],[182,12,182,13],[196,12,196,13],[195,9,195,11],[190,9,190,11],[190,12,190,13],[195,12,195,13],[196,16,196,17],[195,16,195,17],[189,16,189,17],[193,9,193,11],[191,12,191,13],[194,12,194,13],[192,14,192,15],[183,16,183,17],[182,16,182,17],[187,16,187,17],[191,14,191,15],[191,16,191,17],[188,9,188,11],[185,6,185,8],[187,9,187,11],[185,9,185,11],[191,6,191,8],[188,6,188,8],[187,6,187,8],[189,9,189,11],[186,16,186,17],[187,12,187,13],[186,12,186,13],[184,6,184,8],[183,6,183,8],[182,6,182,8],[186,6,186,8],[183,9,183,11],[186,9,186,11],[193,6,193,8],[196,6,196,8],[195,6,195,8],[190,16,190,17],[191,9,191,11],[188,16,188,17],[192,6,192,8],[193,12,193,13],[190,14,190,15],[192,12,192,13],[188,12,188,13],[189,12,189,13],[192,16,192,17],[194,6,194,8],[194,16,194,17],[194,14,194,15],[193,16,193,17],[194,9,194,11],[193,14,193,15],[192,9,192,11],[189,14,189,15],[196,9,196,11],[189,6,189,8],[190,6,190,8],[180,6,180,8],[178,9,178,11],[180,9,180,11],[184,9,184,11],[182,9,182,11],[177,9,177,11],[172,6,172,8],[172,9,172,11],[167,9,167,11],[181,9,181,11],[181,6,181,8],[176,9,176,11],[179,6,179,8],[166,6,166,8],[36,4,36,5],[38,4,38,5],[40,4,40,5],[41,7,41,8],[54,4,54,5],[62,4,63,5],[171,6,171,8],[170,9,170,11],[171,9,171,11],[168,6,168,8],[167,6,167,8],[162,6,162,8],[170,6,170,8],[169,6,169,8],[169,9,169,11],[165,6,165,8],[165,9,165,11],[164,9,164,11],[168,9,168,11],[166,9,166,11],[62,6,63,9],[81,4,81,5],[93,4,93,9],[165,12,165,13],[166,12,166,13],[172,16,172,17],[175,16,175,17],[171,16,171,17],[174,16,174,17],[176,16,176,17],[166,14,166,15],[167,16,167,17],[166,16,166,17],[167,12,167,13],[165,16,165,17],[165,14,165,15],[170,14,170,15],[169,12,169,13],[168,12,168,13],[170,12,170,13],[167,14,167,15],[171,14,171,15],[172,12,172,13],[172,14,172,15],[171,12,171,13],[38,12,38,14],[38,15,38,17],[7,13,7,16],[66,12,66,14],[77,12,77,14],[33,1,33,22],[66,10,66,11],[64,12,64,14],[38,6,38,8],[27,1,27,5],[35,4,35,5],[31,1,31,3],[27,11,27,16],[53,7,53,8],[29,13,29,16],[15,4,15,11],[19,18,19,20],[24,1,24,4],[15,1,15,3],[35,9,35,11],[52,9,52,11],[42,6,42,8],[53,9,53,11],[46,15,46,17],[48,4,48,5],[48,6,48,8],[48,9,48,11],[48,12,48,14],[48,15,48,17],[81,12,81,14],[64,4,64,5],[66,4,66,5],[66,6,66,9],[79,12,79,14],[81,15,81,17],[81,6,81,9],[77,4,77,5],[68,4,68,5],[68,6,68,9],[64,6,64,9]]}
[null,"Registro",null,"ITBI",null,null,"TABELA PRICE",null,null,null,null,null,null,null,null,null,null,null,"Versão 00 01/09/2021"]
[null,0,null,0,null,null,"LANÇAMENTO COMPLETO GUANABARA  - SÃO GONÇALO"]
[null,{"$f":"IF(G33=\"Sim\",B2/2+100,B2)","v":0},null,null,null,null,null,null,null,null,{"$f":"IF(G4=\"ÚNICO SUZANO - TORRE 5\",1,IF(G4=\"ÚNICO SUZANO - FASE 2 - TORRES 4 e 6\",1,0))","v":0},null,null,null,null,null,null,null,",,"]
[null,null,null,null,null,null,"Completo Guanabara - Desconto - Sem Premio",null,null,null,null,null,null,null,null,null,null,null,{"$f":"IF(AND('Premissas e Calculos'!J11*(1-'Premissas e Calculos'!G29)<='Premissas e Calculos'!J3,'Premissas e Calculos'!J13<='Premissas e Calculos'!J3),\"PCVA\",\"Imóvel fora do PCVA\")","v":"PCVA"},null,null,null,null,null,null,null,null,null,null,null,null,null,null,null,null,null,null,null,null,null,null,null,null,null,null,null,null,null,null,null,null,null,null,null,null,null,null,null,null,null,null,null,null,null,null,null,null,null,null,null,null,null,null,null,null,null,null,null,null,null,null,null,null,null,null,null,null,null,null,null,null,null,null,null,null,null,null,null,null,null,null,null,null,null,null,null,null,null,null,null,null,null,null,null,null,null,null,null,null,null,null,null,null,null,null,null,null,null,null,null,null,null,null,null,null,null,null,null,null,null,null,null,null,null,null,null,null,null,null,null,null,null,null,null,null,null,null,null,null,null,null,null,null,null,null,null,null,null,null,null,null,null,null,null,null,null,null,null,null,null,null,null,null,null,null,null,null,null,null,null,null,null,null,null,null,null,null,null,null,null,null,null,null,null,null,null,null,null,null,null,null,null,null,"Empresa de Vendas",null,null,null,null,null,{"$f":"Apoio!B1","v":"Planilha de resposta do empreendimento escolhido"}]
[null,null,null,null,null,null,null,null,null,null,null,null,null,null,null,null,null,null,null,null,null,null,null,null,null,null,null,"Data de Virada da Tabela",null,null,null,null,null,null,null,null,null,null,null,null,null,null,null,null,null,null,null,null,null,null,null,null,null,null,null,null,null,null,null,null,null,null,null,null,null,null,null,null,null,null,null,null,null,null,null,null,null,null,null,null,null,null,null,null,null,null,null,null,null,null,null,null,null,null,null,null,null,null,null,null,null,null,null,null,null,null,null,null,null,null,null,null,null,null,null,null,null,null,null,null,null,null,null,null,null,null,null,null,null,null,null,null,null,null,null,null,null,null,null,null,null,null,null,null,null,null,null,null,null,null,null,null,null,null,null,null,null,null,null,null,null,null,null,null,null,null,null,null,null,null,null,null,null,null,null,null,null,null,null,null,null,null,null,null,null,null,null,null,null,null,null,null,null,null,null,null,null,null,null,null,null,null,null,null,null,null,null,null,null,null,null,null,1,{"$f":"'Premissas e Calculos'!M30","v":"MAIS"},null,null,null,null,null,{"$f":"Apoio!B2","v":"Código Empreendimento"},{"$f":"Apoio!C2","v":0},{"$f":"Apoio!D2","v":2},{"$f":"Apoio!E2","v":0}]
[null,{"$f":"E32&G33","v":"SimNão"},null,null,null,"Unidade:",null,null,"4° andar S/ Vaga",null,null,null,"Valor do Imóvel na Tabela:",null,null,null,null,null,{"$f":"IF(B6=\"SIMSIM\",\"VERIFIQUE AS OPÇÕES\",V6+D2+B3+F32)","v":160140},null,null,{"$f":"IF(I12>AB6,0,VLOOKUP(I6,HM16:HO91,2,FALSE))","v":159390},null,null,null,null,null,{"$f":"'Premissas e Calculos'!G38","v":"2021-09-30"},null,null,null,null,null,null,null,null,null,null,null,null,null,null,null,null,null,null,null,null,null,null,null,null,null,null,null,null,null,null,null,null,null,null,null,null,null,null,null,null,null,null,null,null,null,null,null,null,null,null,null,null,null,null,null,null,null,null,null,null,null,null,null,null,null,null,null,null,null,null,null,null,null,null,null,null,null,null,null,null,null,null,null,null,null,null,null,null,null,null,null,null,null,null,null,null,null,null,null,null,null,null,null,null,null,null,null,null,null,null,null,null,null,null,null,null,null,null,null,null,null,null,null,null,null,null,null,null,null,null,null,null,null,null,null,null,null,null,null,null,null,null,null,null,null,null,null,null,null,null,null,null,null,null,null,null,null,null,null,null,null,null,null,null,null,null,null,null,null,null,null,null,null,null,null,null,null,null,null,null,null,null,null,null,2,{"$f":"'Premissas e Calculos'!M31","v":"CURY VENDAS"},null,null,null,null,null,{"$f":"Apoio!B3","v":"Empreendimento:"},{"$f":"Apoio!C3","v":0},{"$f":"Apoio!D3","v":"Completo Guanabara - Desconto - Sem Premio"}]
[null,null,null,null,null,null,null,null,null,null,null,null,null,null,null,null,null,null,null,null,null,null,null,null,null,null,null,null,null,null,null,null,null,null,null,null,null,null,null,null,null,null,null,null,null,null,null,null,null,null,null,null,null,null,null,null,null,null,null,null,null,null,null,null,null,null,null,null,null,null,null,null,null,null,null,null,null,null,null,null,null,null,null,null,null,null,null,null,null,null,null,null,null,null,null,null,null,null,null,null,null,null,null,null,null,null,null,null,null,null,null,null,null,null,null,null,null,null,null,null,null,null,null,null,null,null,null,null,null,null,null,null,null,null,null,null,null,null,null,null,null,null,null,null,null,null,null,null,null,null,null,null,null,null,null,null,null,null,null,null,null,null,null,null,null,null,null,null,null,null,null,null,null,null,null,null,null,null,null,null,null,null,null,null,null,null,null,null,null,null,null,null,null,null,null,null,null,null,null,null,null,null,null,null,null,null,null,null,null,null,null,null,3,{"$f":"'Premissas e Calculos'!#REF!","v":{"$error":"#REF!"}},null,null,null,null,null,{"$f":"Apoio!B4","v":"Valor Máximo Do Imóvel dentro do Pacote"},{"$f":"Apoio!C4","v":0},{"$f":"Apoio!D4","v":0},{"$f":"Apoio!E4","v":190000}]
[null,null,null,null,null,"Corretor:",null,null,null,null,null,null,null,"Empresa de Venda:",null,null,null,null,"CURY VENDAS",null,null,{"$f":"S6-V6","v":750},null,null,null,null,null,null,null,null,null,null,null,null,null,null,null,null,null,null,null,null,null,null,null,null,null,null,null,null,null,null,null,null,null,null,null,null,null,null,null,null,null,null,null,null,null,null,null,null,null,null,null,null,null,null,null,null,null,null,null,null,null,null,null,null,null,null,null,null,null,null,null,null,null,null,null,null,null,null,null,null,null,null,null,null,null,null,null,null,null,null,null,null,null,null,null,null,null,null,null,null,null,null,null,null,null,null,null,null,null,null,null,null,null,null,null,null,null,null,null,null,null,null,null,null,null,null,null,null,null,null,null,null,null,null,null,null,null,null,null,null,null,null,null,null,null,null,null,null,null,null,null,null,null,null,null,null,null,null,null,null,null,null,null,null,null,null,null,null,null,null,null,null,null,null,null,null,null,null,null,null,null,null,null,null,null,null,null,null,null,null,4,{"$f":"'Premissas e Calculos'!M33","v":"VENDA INTERNA"},null,null,null,null,null,{"$f":"Apoio!B5","v":"Tabela de Unidades disponíveis"},null,null,null,null,null,null,null,null,null,null,null,null,null,null,null,null,null,null,null,null,null,null,null,null,null,null,null,null,null,"Empreendimentos","Empresa de Vendas","Comissão"]
[null,null,null,null,null,null,null,null,null,null,null,null,null,null,null,null,null,null,null,null,null,null,null,null,null,null,null,null,null,null,null,null,null,null,null,null,null,null,null,null,null,null,null,null,null,null,null,null,null,null,null,null,null,null,null,null,null,null,null,null,null,null,null,null,null,null,null,null,null,null,null,null,null,null,null,null,null,null,null,null,null,null,null,null,null,null,null,null,null,null,null,null,null,null,null,null,null,null,null,null,null,null,null,null,null,null,null,null,null,null,null,null,null,null,null,null,null,null,null,null,null,null,null,null,null,null,null,null,null,null,null,null,null,null,null,null,null,null,null,null,null,null,null,null,null,null,null,null,null,null,null,null,null,null,null,null,null,null,null,null,null,null,null,null,null,null,null,null,null,null,null,null,null,null,null,null,null,null,null,null,null,null,null,null,null,null,null,null,null,null,null,null,null,null,null,null,null,null,null,null,null,null,null,null,null,null,null,null,null,null,null,null,5,{"$f":"'Premissas e Calculos'!M34","v":0},null,null,null,null,null,{"$f":"Apoio!B6","v":0},{"$f":"Apoio!C6","v":"Código Tipo"},{"$f":"Apoio!D6","v":"Código Venda"},{"$f":"Apoio!E6","v":"Código Avaliação"}]
[null,"10 Mil a mais FAKE",null,null,null,"Gerente:",null,null,null,null,null,null,null,null,"Data das Chaves:",null,null,null,{"$f":"VLOOKUP(G4,'DADOS DOS EMPREENDIMENTOS'!B10:K28,10,FALSE)","v":"2024-01-10"},null,null,null,null,null,null,null,null,null,null,null,null,null,null,null,null,null,null,null,null,null,null,null,null,null,null,null,null,null,null,null,null,null,null,null,null,null,null,null,null,null,null,null,null,null,null,null,null,null,null,null,null,null,null,null,null,null,null,null,null,null,null,null,null,null,null,null,null,null,null,null,null,null,null,null,null,null,null,null,null,null,null,null,null,null,null,null,null,null,null,null,null,null,null,null,null,null,null,null,null,null,null,null,null,null,null,null,null,null,null,null,null,null,null,null,null,null,null,null,null,null,null,null,null,null,null,null,null,null,null,null,null,null,null,null,null,null,null,null,null,null,null,null,null,null,null,null,null,null,null,null,null,null,null,null,null,null,null,null,null,null,null,null,null,null,null,null,null,null,null,null,null,null,null,null,null,null,null,null,null,null,null,null,null,null,null,null,null,null,null,null,null,null,6,{"$f":"'Premissas e Calculos'!M32","v":"CURY & CIA"}]
[null,null,null,null,null,null,null,null,null,null,null,null,null,null,null,null,null,null,null,null,null,null,null,null,null,null,null,"ÚNICO SUZANO - TORRE 4 e 6",7,7,null,null,null,null,null,null,null,null,null,null,null,null,null,null,null,null,null,null,null,null,null,null,null,null,null,null,null,null,null,null,null,null,null,null,null,null,null,null,null,null,null,null,null,null,null,null,null,null,null,null,null,null,null,null,null,null,null,null,null,null,null,null,null,null,null,null,null,null,null,null,null,null,null,null,null,null,null,null,null,null,null,null,null,null,null,null,null,null,null,null,null,null,null,null,null,null,null,null,null,null,null,null,null,null,null,null,null,null,null,null,null,null,null,null,null,null,null,null,null,null,null,null,null,null,null,null,null,null,null,null,null,null,null,null,null,null,null,null,null,null,null,null,null,null,null,null,null,null,null,null,null,null,null,null,null,null,null,null,null,null,null,null,null,null,null,null,null,null,null,null,null,null,null,null,null,null,null,null,null,null,null,null,7,{"$f":"'Premissas e Calculos'!M36","v":0},null,null,null,null,null,null,{"$f":"Apoio!C7","v":7},{"$f":"Apoio!D7","v":8},{"$f":"Apoio!E7","v":9}]
[null,null,null,null,null,"Data:","Data:",null,{"$f":"TODAY()","v":"2021-09-01"},null,null,null,null,null,null,null,null,null,null,null,null,null,null,null,null,null,null,"ÚNICO SUZANO - TORRE 5",8,8,null,null,null,null,null,null,null,null,null,null,null,null,null,null,null,null,null,null,null,null,null,null,null,null,null,null,null,null,null,null,null,null,null,null,null,null,null,null,null,null,null,null,null,null,null,null,null,null,null,null,null,null,null,null,null,null,null,null,null,null,null,null,null,null,null,null,null,null,null,null,null,null,null,null,null,null,null,null,null,null,null,null,null,null,null,null,null,null,null,null,null,null,null,null,null,null,null,null,null,null,null,null,null,null,null,null,null,null,null,null,null,null,null,null,null,null,null,null,null,null,null,null,null,null,null,null,null,null,null,null,null,null,null,null,null,null,null,null,null,null,null,null,null,null,null,null,null,null,null,null,null,null,null,null,null,null,null,null,null,null,null,null,null,null,null,null,null,null,null,null,null,null,null,null,null,null,null,"Valor Máximo FGTS",null,null,null,null,8,{"$f":"'Premissas e Calculos'!M37","v":0},null,null,null,null,null,null,{"$f":"Apoio!C8","v":"Tipo"},{"$f":"Apoio!D8","v":"Preço de Venda"},{"$f":"Apoio!E8","v":"Avaliação CAIXA"},null,null,{"$f":"'DADOS DOS EMPREENDIMENTOS'!A8","v":"Código dos dos empreendimentos"},null,null,null,null,null,null,null,null,null,null,null,null,null,null,null,null,null,null,null,null,null,null,null,"FATTO SPORT FARIA LIMA","SELLING",2.9000000000000001E-2]
[]
[null,"1. INFORMAÇÕES DO CLIENTE",null,null,null,null,null,null,null,null,null,null,null,null,null,null,null,null,null,null,null,null,null,null,null,null,null,null,null,null,null,null,null,null,null,null,null,null,null,null,null,null,null,null,null,null,null,null,null,null,null,null,null,null,null,null,null,null,null,null,null,null,null,null,null,null,null,null,null,null,null,null,null,null,null,null,null,null,null,null,null,null,null,null,null,null,null,null,null,null,null,null,null,null,null,null,null,null,null,null,null,null,null,null,null,null,null,null,null,null,null,null,null,null,null,null,null,null,null,null,null,null,null,null,null,null,null,null,null,null,null,null,null,null,null,null,null,null,null,null,null,null,null,null,null,null,null,null,null,null,null,null,null,null,null,null,null,null,null,null,null,null,null,null,null,null,null,null,null,null,null,null,null,null,null,null,null,null,null,null,null,null,null,null,null,null,null,null,null,null,null,null,null,null,null,null,null,null,null,null,null,null,null,null,null,null,null,{"$f":"'Premissas e Calculos'!J25","v":142379},null,null,null,null,9,{"$f":"'Premissas e Calculos'!M38","v":0}]
[null,null,null,null,null,null,null,null,null,null,null,null,null,null,null,null,null,null,null,null,null,null,null,null,null,null,null,null,null,null,null,null,null,null,null,null,null,null,null,null,null,null,null,null,null,null,null,null,null,null,null,null,null,null,null,null,null,null,null,null,null,null,null,null,null,null,null,null,null,null,null,null,null,null,null,null,null,null,null,null,null,null,null,null,null,null,null,null,null,null,null,null,null,null,null,null,null,null,null,null,null,null,null,null,null,null,null,null,null,null,null,null,null,null,null,null,null,null,null,null,null,null,null,null,null,null,null,null,null,null,null,null,null,null,null,null,null,null,null,null,null,null,null,null,null,null,null,null,null,null,null,null,null,null,null,null,null,null,null,null,null,null,null,null,null,null,null,null,null,null,null,null,null,null,null,null,null,null,null,null,null,null,null,null,null,null,null,null,null,null,null,null,null,null,null,null,null,null,null,null,null,null,null,null,null,null,null,null,null,null,null,null,10,{"$f":"'Premissas e Calculos'!M39","v":0}]
[null,"1.1  Nome do Cliente:",null,null,null,null,null,null,null,null,null,null,"1.2.  Data nascimento:",null,null,null,null,null,19,5,1994,null,null,null,null,null,null,null,null,null,null,null,null,null,null,null,null,null,null,null,null,null,null,null,null,null,null,null,null,null,null,null,null,null,null,null,null,null,null,null,null,null,null,null,null,null,null,null,null,null,null,null,null,null,null,null,null,null,null,null,null,null,null,null,null,null,null,null,null,null,null,null,null,null,null,null,null,null,null,null,null,null,null,null,null,null,null,null,null,null,null,null,null,null,null,null,null,null,null,null,null,null,null,null,null,null,null,null,null,null,null,null,null,null,null,null,null,null,null,null,null,null,null,null,null,null,null,null,null,null,null,null,null,null,null,null,null,null,null,null,null,null,null,null,null,null,null,null,null,null,null,null,null,null,null,null,null,null,null,null,null,null,null,null,null,null,null,null,null,null,null,null,null,null,null,null,null,null,null,null,null,null,null,null,null,null,null,null,null,null,null,null,11,{"$f":"'Premissas e Calculos'!M40","v":0},null,null,null,null,null,{"$f":"Apoio!B9","v":1},{"$f":"Apoio!C9","v":"5° andar S/ Vaga"},{"$f":"Apoio!D9","v":157390},{"$f":"Apoio!E9","v":158000}]
[null,null,null,null,null,null,null,null,null,null,null,null,null,null,null,null,null,null,null,null,null,null,null,null,null,null,null,null,null,null,null,null,null,null,null,null,null,null,null,null,null,null,null,null,null,null,null,null,null,null,null,null,null,null,null,null,null,null,null,null,null,null,null,null,null,null,null,null,null,null,null,null,null,null,null,null,null,null,null,null,null,null,null,null,null,null,null,null,null,null,null,null,null,null,null,null,null,null,null,null,null,null,null,null,null,null,null,null,null,null,null,null,null,null,null,null,null,null,null,null,null,null,null,null,null,null,null,null,null,null,null,null,null,null,null,null,null,null,null,null,null,null,null,null,null,null,null,null,null,null,null,null,null,null,null,null,null,null,null,null,null,null,null,null,null,null,null,null,null,null,null,null,null,null,null,null,null,null,null,null,null,null,null,null,null,null,null,null,null,null,null,null,null,null,null,null,null,null,null,null,null,null,null,null,null,null,null,null,null,null,null,null,null,{"$f":"'Premissas e Calculos'!M41","v":0},null,null,null,null,null,{"$f":"Apoio!B10","v":2},{"$f":"Apoio!C10","v":"4° andar S/ Vaga"},{"$f":"Apoio!D10","v":159390},{"$f":"Apoio!E10","v":158000}]
[null,null,null,null,null,null,null,null,null,null,null,null,null,null,null,null,null,null,null,null,null,null,null,null,null,null,null,null,null,null,null,null,null,null,null,null,null,null,null,null,null,null,null,null,null,null,null,null,null,null,null,null,null,null,null,null,null,null,null,null,null,null,null,null,null,null,null,null,null,null,null,null,null,null,null,null,null,null,null,null,null,null,null,null,null,null,null,null,null,null,null,null,null,null,null,null,null,null,null,null,null,null,null,null,null,null,null,null,null,null,null,null,null,null,null,null,null,null,null,null,null,null,null,null,null,null,null,null,null,null,null,null,null,null,null,null,null,null,null,null,null,null,null,null,null,null,null,null,null,null,null,null,null,null,null,null,null,null,null,null,null,null,null,null,null,null,null,null,null,null,null,null,null,null,null,null,null,null,null,null,null,null,null,null,null,null,null,null,null,null,null,null,null,null,null,null,null,null,null,null,null,null,null,null,null,null,null,null,null,null,null,null,12,{"$f":"'Premissas e Calculos'!M42","v":0},null,null,null,null,null,{"$f":"Apoio!B11","v":3},{"$f":"Apoio!C11","v":"4° andar C/ Vaga"},{"$f":"Apoio!D11","v":173390},{"$f":"Apoio!E11","v":172000},null,null,{"$f":"'DADOS DOS EMPREENDIMENTOS'!A10","v":1},{"$f":"'DADOS DOS EMPREENDIMENTOS'!B10","v":"Completo Guanabara - Premio Volta Caixa"},{"$f":"'DADOS DOS EMPREENDIMENTOS'!C10","v":1},null,null,null,null,null,null,null,null,null,null,null,null,null,null,null,null,null,null,null,null,null,"FATTO JARDIM BOTANICO","HABITCASA",3.2500000000000001E-2]
[null,null,null,null,null,null,null,null,null,{"$f":"IF(E32=\"NÃO\",\"Cliente fora do PCVA, Será cobrado pelo banco uma Taxa no valor de R$ 3500,00 no momento de assinatura da minuta de financiamento\",\"\")","v":""},null,null,null,null,null,null,null,null,null,null,null,null,null,null,null,null,null,null,null,null,null,null,null,null,null,null,null,null,null,null,null,null,null,null,null,null,null,null,null,null,null,null,null,null,null,null,null,null,null,null,null,null,null,null,null,null,null,null,null,null,null,null,null,null,null,null,null,null,null,null,null,null,null,null,null,null,null,null,null,null,null,null,null,null,null,null,null,null,null,null,null,null,null,null,null,null,null,null,null,null,null,null,null,null,null,null,null,null,null,null,null,null,null,null,null,null,null,null,null,null,null,null,null,null,null,null,null,null,null,null,null,null,null,null,null,null,null,null,null,null,null,null,null,null,null,null,null,null,null,null,null,null,null,null,null,null,null,null,null,null,null,null,null,null,null,null,null,null,null,null,null,null,null,null,null,null,null,null,null,null,null,null,null,null,null,null,null,null,null,null,null,null,null,null,null,null,null,"Sim",null,null,null,null,13,{"$f":"'Premissas e Calculos'!M43","v":0},null,null,null,null,null,{"$f":"Apoio!B12","v":4},{"$f":"Apoio!C12","v":"3°andar C/ Vaga"},{"$f":"Apoio!D12","v":173390},{"$f":"Apoio!E12","v":178000},null,null,{"$f":"'DADOS DOS EMPREENDIMENTOS'!A11","v":2},{"$f":"'DADOS DOS EMPREENDIMENTOS'!B11","v":"Completo Guanabara - Desconto - Sem Premio"},{"$f":"'DADOS DOS EMPREENDIMENTOS'!C11","v":2},null,null,null,null,null,null,null,null,null,null,null,null,null,null,null,null,null,null,null,null,null,"VITÓRIA PIRITUBA"]
[null,"1.3. Renda Familiar Total: ",null,null,null,2150,null,null,null,null,null,null,null,"1.4.  Valor do FGTS:",null,null,null,null,5000,null,null,null,null,null,null,{"$f":"IF(G1=\"TABELA PRICE\",0,1)","v":0},{"$f":"IF(H2=\"TABELA PRICE\",0,1)","v":1},"TABELA SAC",null,null,null,null,null,null,null,null,null,null,null,null,null,null,null,null,null,null,null,null,null,null,null,null,null,null,null,null,null,null,null,null,null,null,null,null,null,null,null,null,null,null,null,null,null,null,null,null,null,null,null,null,null,null,null,null,null,null,null,null,null,null,null,null,null,null,null,null,null,null,null,null,null,null,null,null,null,null,null,null,null,null,null,null,null,null,null,null,null,null,null,null,null,null,null,null,null,null,null,null,null,null,null,null,null,null,null,null,null,null,null,null,null,null,null,null,null,null,null,null,null,null,null,null,null,null,null,null,null,null,null,null,null,null,null,null,null,null,null,null,null,null,null,null,null,null,null,null,null,null,null,null,null,null,null,null,null,null,null,null,null,null,null,null,null,null,null,null,null,null,null,null,null,null,null,null,null,null,null,null,null,null,null,null,null,{"$f":"'Premissas e Calculos'!M44","v":0},null,null,null,null,null,{"$f":"Apoio!B13","v":5},{"$f":"Apoio!C13","v":"2°andar C/ Vaga"},{"$f":"Apoio!D13","v":174390},{"$f":"Apoio!E13","v":178000},null,null,{"$f":"'DADOS DOS EMPREENDIMENTOS'!A12","v":3},{"$f":"'DADOS DOS EMPREENDIMENTOS'!B12","v":0},{"$f":"'DADOS DOS EMPREENDIMENTOS'!C12","v":3}]
["1.3.1 Qtd Compradores"]
[null,null,null,2]
[null,null,1,{"$f":"D22","v":2},null,{"$f":"F20*50%","v":1075},null,null,null,null,null,null,null,null,null,null,null,null,null,"+",null,null,null,null,null,null,null,"TABELA PRICE",null,null,null,null,null,null,null,null,null,null,null,null,null,null,null,null,null,null,null,null,null,null,null,null,null,null,null,null,null,null,null,null,null,null,null,null,null,null,null,null,null,null,null,null,null,null,null,null,null,null,null,null,null,null,null,null,null,null,null,null,null,null,null,null,null,null,null,null,null,null,null,null,null,null,null,null,null,null,null,null,null,null,null,null,null,null,null,null,null,null,null,null,null,null,null,null,null,null,null,null,null,null,null,null,null,null,null,null,null,null,null,null,null,null,null,null,null,null,null,null,null,null,null,null,null,null,null,null,null,null,null,null,null,null,null,null,null,null,null,null,null,null,null,null,null,null,null,null,null,null,null,null,null,null,null,null,null,null,null,null,null,null,null,null,null,null,null,null,null,null,null,null,null,null,null,null,null,null,null,"Não",null,null,null,null,14,{"$f":"'Premissas e Calculos'!M45","v":0},null,null,null,null,null,{"$f":"Apoio!B14","v":6},{"$f":"Apoio!C14","v":"1° andar S/ Vaga"},{"$f":"Apoio!D14","v":158390},{"$f":"Apoio!E14","v":151000},null,null,{"$f":"'DADOS DOS EMPREENDIMENTOS'!A13","v":4},{"$f":"'DADOS DOS EMPREENDIMENTOS'!B13","v":0},{"$f":"'DADOS DOS EMPREENDIMENTOS'!C13","v":4}]
[null,null,2,null,null,{"$f":"IF(E32=\"não\",8.66%,'Premissas e Calculos'!J9)","v":0.05},"a.a.",null,{"$f":"IF(S20>0,\"(Redução de 0,5% na taxa de juros)\",\"\")","v":"(Redução de 0,5% na taxa de juros)"},null,null,null,null,null,null,"1.6. Subsídio:",null,null,{"$f":"'Premissas e Calculos'!J17","v":17011},null,null,null,null,null,null,null,null,null,null,null,null,null,null,null,null,null,null,null,null,null,null,null,null,null,null,null,null,null,null,null,null,null,null,null,null,null,null,null,null,null,null,null,null,null,null,null,null,null,null,null,null,null,null,null,null,null,null,null,null,null,null,null,null,null,null,null,null,null,null,null,null,null,null,null,null,null,null,null,null,null,null,null,null,null,null,null,null,null,null,null,null,null,null,null,null,null,null,null,null,null,null,null,null,null,null,null,null,null,null,null,null,null,null,null,null,null,null,null,null,null,null,null,null,null,null,null,null,null,null,null,null,null,null,null,null,null,null,null,null,null,null,null,null,null,null,null,null,null,null,null,null,null,null,null,null,null,null,null,null,null,null,null,null,null,null,null,null,null,null,null,null,null,null,null,null,null,null,null,null,null,null,null,null,null,null,null,null,null,null,null,null,null,15,{"$f":"'Premissas e Calculos'!M46","v":0},null,null,null,null,null,{"$f":"Apoio!B15","v":7},{"$f":"Apoio!C15","v":"1° andar C/ Vaga"},{"$f":"Apoio!D15","v":172390},{"$f":"Apoio!E15","v":179000},null,null,{"$f":"'DADOS DOS EMPREENDIMENTOS'!A14","v":5},{"$f":"'DADOS DOS EMPREENDIMENTOS'!B14","v":0},{"$f":"'DADOS DOS EMPREENDIMENTOS'!C14","v":5}]
[null,"1.5.  Taxa de Juros Nominal: ",null,null,null,null,null,null,null,null,{"$f":"F20*2","v":4300},null,null,null,null,null,null,null,null,"+",null,null,null,null,null,null,null,null,null,null,null,null,null,null,null,null,null,null,null,null,null,null,null,null,null,null,null,null,null,null,null,null,null,null,null,null,null,null,null,null,null,null,null,null,null,null,null,null,null,null,null,null,null,null,null,null,null,null,null,null,null,null,null,null,null,null,null,null,null,null,null,null,null,null,null,null,null,null,null,null,null,null,null,null,null,null,null,null,null,null,null,null,null,null,null,null,null,null,null,null,null,null,null,null,null,null,null,null,null,null,null,null,null,null,null,null,null,null,null,null,null,null,null,null,null,null,null,null,null,null,null,null,null,null,null,null,null,null,null,null,null,null,null,null,null,null,null,null,null,null,null,null,null,null,null,null,null,null,null,null,null,null,null,null,null,null,null,null,null,null,null,null,null,null,null,null,null,null,null,null,null,null,null,null,null,null,null,null,null,null,null,null,16,{"$f":"'Premissas e Calculos'!M47","v":0},null,null,null,null,null,{"$f":"Apoio!B16","v":8},{"$f":"Apoio!C16","v":"1º andar 1 Quarto (PNE)"},{"$f":"Apoio!D16","v":162390},{"$f":"Apoio!E16","v":171000},null,null,{"$f":"'DADOS DOS EMPREENDIMENTOS'!A15","v":6},{"$f":"'DADOS DOS EMPREENDIMENTOS'!B15","v":0},{"$f":"'DADOS DOS EMPREENDIMENTOS'!C15","v":6},null,null,null,null,null,null,null,null,null,null,null,null,null,null,null,null,null,null,null,null,null,"Prazo","Valor Financiado","1 Prestação","ÚLTIMA"]
[null,null,null,null,null,{"$f":"F24/12","v":4.1666666666666666E-3},"a.m.",null,null,null,null,"1.8. Valor Máximo Financiado:",null,null,null,null,null,null,{"$f":"IF((V6-((IF(ROUND(IF(G31=\"PRAZO EXCEDIDO\",\"ERRO\",'Premissas e Calculos'!O10),0)>=0,ROUND(IF(G29=\"PRAZO EXCEDIDO\",\"ERRO\",'Premissas e Calculos'!O10),0),0)*'Premissas e Calculos'!G32)+S24+S20))>S29,(IF(ROUND(IF(G29=\"PRAZO EXCEDIDO\",\"ERRO\",'Premissas e Calculos'!O10),0)>=0,ROUND(IF(G29=\"PRAZO EXCEDIDO\",\"ERRO\",'Premissas e Calculos'!O10),0),0)*'Premissas e Calculos'!G32),V6-S28-S20-S24)","v":117750},null,null,null,null,null,null,null,null,null,null,null,null,null,null,null,null,null,null,null,null,null,null,null,null,null,null,null,null,null,null,null,null,null,null,null,null,null,null,null,null,null,null,null,null,null,null,null,null,null,null,null,null,null,null,null,null,null,null,null,null,null,null,null,null,null,null,null,null,null,null,null,null,null,null,null,null,null,null,null,null,null,null,null,null,null,null,null,null,null,null,null,null,null,null,null,null,null,null,null,null,null,null,null,null,null,null,null,null,null,null,null,null,null,null,null,null,null,null,null,null,null,null,null,null,null,null,null,null,null,null,null,null,null,null,null,null,null,null,null,null,null,null,null,null,null,null,null,null,null,null,null,null,null,null,null,null,null,null,null,null,null,null,null,null,null,null,null,null,null,null,null,null,null,null,null,null,null,null,null,null,null,null,null,null,null,null,null,null,null,null,null,null,null,17,{"$f":"'Premissas e Calculos'!M48","v":0},null,null,null,null,null,{"$f":"Apoio!B17","v":9},{"$f":"Apoio!C17","v":0},{"$f":"Apoio!D17","v":0},{"$f":"Apoio!E17","v":0},null,null,{"$f":"'DADOS DOS EMPREENDIMENTOS'!A16","v":7},{"$f":"'DADOS DOS EMPREENDIMENTOS'!B16","v":0},{"$f":"'DADOS DOS EMPREENDIMENTOS'!C16","v":7},null,null,null,null,null,null,null,null,null,null,null,null,null,null,null,null,null,null,null,null,null,240,{"$f":"repasse240","v":{"$error":"#REF!"}},{"$f":"#REF!","v":{"$error":"#REF!"}},{"$f":"#REF!/IP26","v":{"$error":"#REF!"}}]
[null,null,null,null,null,null,null,null,null,null,null,null,null,null,null,null,null,null,null,"=",null,null,null,null,null,null,null,null,null,null,null,null,null,null,null,null,null,null,null,null,null,null,null,null,null,null,null,null,null,null,null,null,null,null,null,null,null,null,null,null,null,null,null,null,null,null,null,null,null,null,null,null,null,null,null,null,null,null,null,null,null,null,null,null,null,null,null,null,null,null,null,null,null,null,null,null,null,null,null,null,null,null,null,null,null,null,null,null,null,null,null,null,null,null,null,null,null,null,null,null,null,null,null,null,null,null,null,null,null,null,null,null,null,null,null,null,null,null,null,null,null,null,null,null,null,null,null,null,null,null,null,null,null,null,null,null,null,null,null,null,null,null,null,null,null,null,null,null,null,null,null,null,null,null,null,null,null,null,null,null,null,null,null,null,null,null,null,null,null,null,null,null,null,null,null,null,null,null,null,null,null,null,null,null,null,null,null,null,null,null,null,null,18,{"$f":"'Premissas e Calculos'!M49","v":0},null,null,null,null,null,{"$f":"Apoio!B18","v":10},{"$f":"Apoio!C18","v":0},{"$f":"Apoio!D18","v":0},{"$f":"Apoio!E18","v":0},null,null,{"$f":"'DADOS DOS EMPREENDIMENTOS'!A18","v":8},{"$f":"'DADOS DOS EMPREENDIMENTOS'!B18","v":0},{"$f":"'DADOS DOS EMPREENDIMENTOS'!C18","v":8},null,null,null,null,null,null,null,null,null,null,null,null,null,null,null,null,null,null,null,null,null,300,{"$f":"repasse300","v":{"$error":"#REF!"}},{"$f":"#REF!","v":{"$error":"#REF!"}},{"$f":"#REF!/IP27","v":{"$error":"#REF!"}}]
[null,"1.7. Prazo de Financiamento Pós Obra:",null,null,null,null,360,null,null,null,null,"1.9. Valor Máximo de Repasse:",null,null,null,null,null,null,{"$f":"SUM(S26,S24,S20)","v":139761},null,null,null,null,null,null,null,null,null,null,null,null,null,null,null,null,null,null,null,null,null,null,null,null,null,null,null,null,null,null,null,null,null,null,null,null,null,null,null,null,null,null,null,null,null,null,null,null,null,null,null,null,null,null,null,null,null,null,null,null,null,null,null,null,null,null,null,null,null,null,null,null,null,null,null,null,null,null,null,null,null,null,null,null,null,null,null,null,null,null,null,null,null,null,null,null,null,null,null,null,null,null,null,null,null,null,null,null,null,null,null,null,null,null,null,null,null,null,null,null,null,null,null,null,null,null,null,null,null,null,null,null,null,null,null,null,null,null,null,null,null,null,null,null,null,null,null,null,null,null,null,null,null,null,null,null,null,null,null,null,null,null,null,null,null,null,null,null,null,null,null,null,null,null,null,null,null,null,null,null,null,null,null,null,null,null,null,null,null,null,null,null,null,19,{"$f":"'Premissas e Calculos'!M50","v":0},null,null,null,null,null,{"$f":"Apoio!B19","v":11},{"$f":"Apoio!C19","v":0},{"$f":"Apoio!D19","v":0},{"$f":"Apoio!E19","v":0},null,null,{"$f":"'DADOS DOS EMPREENDIMENTOS'!A19","v":9},{"$f":"'DADOS DOS EMPREENDIMENTOS'!B19","v":0},{"$f":"'DADOS DOS EMPREENDIMENTOS'!C19","v":9},null,null,null,null,null,null,null,null,null,null,null,null,null,null,null,null,null,null,null,null,null,360,{"$f":"#REF!","v":{"$error":"#REF!"}},{"$f":"#REF!","v":{"$error":"#REF!"}},{"$f":"#REF!/IP28","v":{"$error":"#REF!"}}]
[null,null,null,null,null,null,{"$f":"IF(G28<='Premissas e Calculos'!O16,\"OK\",IF('Premissas e Calculos'!O16<0,\"Não é possível financiar. Idade superior à permitida.\",CONCATENATE(\"PRAZO EXCEDIDO, MÁXIMO: \",'Premissas e Calculos'!O16, \" MESES\")))","v":"OK"},null,null,null,null,null,null,null,null,null,null,null,null,null,null,null,null,null,null,null,null,null,null,null,null,null,null,null,null,null,null,null,null,null,null,null,null,null,null,null,null,null,null,null,null,null,null,null,null,null,null,null,null,null,null,null,null,null,null,null,null,null,null,null,null,null,null,null,null,null,null,null,null,null,null,null,null,null,null,null,null,null,null,null,null,null,null,null,null,null,null,null,null,null,null,null,null,null,null,null,null,null,null,null,null,null,null,null,null,null,null,null,null,null,null,null,null,null,null,null,null,null,null,null,null,null,null,null,null,null,null,null,null,null,null,null,null,null,null,null,null,null,null,null,null,null,null,null,null,null,null,null,null,null,null,null,null,null,null,null,null,null,null,null,null,null,null,null,null,null,null,null,null,null,null,null,null,null,null,null,null,null,null,null,null,null,null,null,null,null,null,null,null,null,null,null,null,null,null,null,"Botões PV",null,null,null,null,null,20,{"$f":"'Premissas e Calculos'!M51","v":0},null,null,null,null,null,{"$f":"Apoio!B20","v":12},{"$f":"Apoio!C20","v":0},{"$f":"Apoio!D20","v":0},{"$f":"Apoio!E20","v":0},null,null,{"$f":"'DADOS DOS EMPREENDIMENTOS'!A22","v":10},{"$f":"'DADOS DOS EMPREENDIMENTOS'!B22","v":0},{"$f":"'DADOS DOS EMPREENDIMENTOS'!C22","v":10}]
[null,null,null,null,null,null,null,null,null,null,null,null,null,"1.10.  Casa Paulista:",null,null,null,null,null,null,null,null,null,null,null,null,null,"Teste lógico - Parcela Máxima x Parcela tabela",null,null,null,null,null,null,null,null,null,null,null,null,null,null,null,null,null,null,null,null,null,null,null,null,null,null,null,null,null,null,null,null,null,null,null,null,null,null,null,null,null,null,null,null,null,null,null,null,null,null,null,null,null,null,null,null,null,null,null,null,null,null,null,null,null,null,null,null,null,null,null,null,null,null,null,null,null,null,null,null,null,null,null,null,null,null,null,null,null,null,null,null,null,null,null,null,null,null,null,null,null,null,null,null,null,null,null,null,null,null,null,null,null,null,null,null,null,null,null,null,null,null,null,null,null,null,null,null,null,null,null,null,null,null,null,null,null,null,null,null,null,null,null,null,null,null,null,null,null,null,null,null,null,null,null,null,null,null,null,null,null,null,null,null,null,null,null,null,null,null,null,null,null,null,null,null,null,null,null,null,null,null,null,null,null,null,null,null,null,null,null,{"$f":"Apoio!B21","v":13},{"$f":"Apoio!C21","v":{"$error":"#N/A"}},{"$f":"Apoio!D21","v":{"$error":"#N/A"}},{"$f":"Apoio!E21","v":{"$error":"#N/A"}},null,null,{"$f":"'DADOS DOS EMPREENDIMENTOS'!A24","v":11},{"$f":"'DADOS DOS EMPREENDIMENTOS'!B24","v":0},{"$f":"'DADOS DOS EMPREENDIMENTOS'!C24","v":11}]
[null,null,null,null,null,null,{"$f":"IF(G28<='Premissas e Calculos'!O16,\"OK\",IF('Premissas e Calculos'!O16<0,\"Não é possível financiar. Idade superior à permitida.\",CONCATENATE(\"PRAZO EXCEDIDO, MÁXIMO: \",'Premissas e Calculos'!O16,\" MESES\")))","v":"OK"},null,null,null,null,null,null,null,null,null,null,null,null,null,null,null,null,null,null,null,null,{"$f":"IF(M43>N32,M43,N32)","v":800.7},null,null,null,null,null,null,null,null,null,null,null,null,null,null,null,null,null,null,null,null,null,null,null,null,null,null,null,null,null,null,null,null,null,null,null,null,null,null,null,null,null,null,null,null,null,null,null,null,null,null,null,null,null,null,null,null,null,null,null,null,null,null,null,null,null,null,null,null,null,null,null,null,null,null,null,null,null,null,null,null,null,null,null,null,null,null,null,null,null,null,null,null,null,null,null,null,null,null,null,null,null,null,null,null,null,null,null,null,null,null,null,null,null,null,null,null,null,null,null,null,null,null,null,null,null,null,null,null,null,null,null,null,null,null,null,null,null,null,null,null,null,null,null,null,null,null,null,null,null,null,null,null,null,null,null,null,null,null,null,null,null,null,null,null,null,null,null,null,null,null,null,null,null,null,null,null,null,null,null,null,null,null,null,null,null,null,null,null,null,null,null,null,null,null,null,null,null,{"$f":"'DADOS DOS EMPREENDIMENTOS'!A26","v":12},{"$f":"'DADOS DOS EMPREENDIMENTOS'!B26","v":0},{"$f":"'DADOS DOS EMPREENDIMENTOS'!C26","v":12}]
[null,"1.11. Cliente PCVA?",null,null,"Sim",{"$f":"IF(E32=\"Não\",750,750)","v":750},null,null,null,"1.12. Mensal Máxima:",null,null,"R$",{"$f":"(F20*30%)","v":645},null,null,"1.13.  Total:",null,{"$f":"S30+S28","v":139761},null,null,null,null,null,null,null,null,{"$f":"IF(M45>N32,M45,N32)","v":645},null,null,null,null,null,null,null,null,null,null,null,null,null,null,null,null,null,null,null,null,null,null,null,null,null,null,null,null,null,null,null,null,null,null,null,null,null,null,null,null,null,null,null,null,null,null,null,null,null,null,null,null,null,null,null,null,null,null,null,null,null,null,null,null,null,null,null,null,null,null,null,null,null,null,null,null,null,null,null,null,null,null,null,null,null,null,null,null,null,null,null,null,null,null,null,null,null,null,null,null,null,null,null,null,null,null,null,null,null,null,null,null,null,null,null,null,null,null,null,null,null,null,null,null,null,null,null,null,null,null,null,null,null,null,null,null,null,null,null,null,null,null,null,null,null,null,null,null,null,null,null,null,null,null,null,null,null,null,null,null,null,null,null,null,null,null,null,null,null,null,null,null,null,null,null,null,null,null,null,null,null,null,null,null,null,null,null,null,null,null,null,null,null,null,null,null,null,{"$f":"'DADOS DOS EMPREENDIMENTOS'!A27","v":13},{"$f":"'DADOS DOS EMPREENDIMENTOS'!B27","v":0},{"$f":"'DADOS DOS EMPREENDIMENTOS'!C27","v":13}]
[null,"PRIMEIRA AQUISIÇÃO DO CLIENTE?",null,null,null,null,"Não",null,null,null,null,null,null,null,null,null,null,null,null,null,null,null,null,null,null,null,null,null,null,null,null,null,null,null,null,null,null,null,null,null,null,null,null,null,null,null,null,null,null,null,null,null,null,null,null,null,null,null,null,null,null,null,null,null,null,null,null,null,null,null,null,null,null,null,null,null,null,null,null,null,null,null,null,null,null,null,null,null,null,null,null,null,null,null,null,null,null,null,null,null,null,null,null,null,null,null,null,null,null,null,null,null,null,null,null,null,null,null,null,null,null,null,null,null,null,null,null,null,null,null,null,null,null,null,null,null,null,null,null,null,null,null,null,null,null,null,null,null,null,null,null,null,null,null,null,null,null,null,null,null,null,null,null,null,null,null,null,null,null,null,null,null,null,null,null,null,null,null,null,null,null,null,null,null,null,null,null,null,null,null,null,null,null,null,null,null,null,null,null,null,null,null,null,null,null,null,null,null,null,null,null,null,21,{"$f":"'Premissas e Calculos'!M52","v":0},null,null,null,null,null,null,null,null,null,null,null,{"$f":"'DADOS DOS EMPREENDIMENTOS'!A28","v":14},{"$f":"'DADOS DOS EMPREENDIMENTOS'!B28","v":0},{"$f":"'DADOS DOS EMPREENDIMENTOS'!C28","v":14}]
[null,"2. PROPOSTA DO CLIENTE",null,null,null,null,null,null,null,null,null,null,null,null,null,null,null,null,null,null,null,null,null,null,null,null,null,null,null,null,null,null,null,null,null,null,null,null,null,null,null,null,null,null,null,null,null,null,null,null,null,null,null,null,null,null,null,null,null,null,null,null,null,null,null,null,null,null,null,null,null,null,null,null,null,null,null,null,null,null,null,null,null,null,null,null,null,null,null,null,null,null,null,null,null,null,null,null,null,null,null,null,null,null,null,null,null,null,null,null,null,null,null,null,null,null,null,null,null,null,null,null,null,null,null,null,null,null,null,null,null,null,null,null,null,null,null,null,null,null,null,null,null,null,null,null,null,null,null,null,null,null,null,null,null,null,null,null,null,null,null,null,null,null,null,null,null,null,null,null,null,null,null,null,null,null,null,null,null,null,null,null,null,null,null,null,null,null,null,null,null,null,null,null,null,null,null,null,null,null,null,null,null,null,null,null,"Mensal",1,null,null,null,null,22,{"$f":"'Premissas e Calculos'!M53","v":0},null,null,null,null,null,null,null,null,null,null,null,{"$f":"'DADOS DOS EMPREENDIMENTOS'!A29","v":0},{"$f":"'DADOS DOS EMPREENDIMENTOS'!B29","v":0},{"$f":"'DADOS DOS EMPREENDIMENTOS'!C29","v":0}]
[null,null,null,null,null,null,null,null,null,null,null,null,null,null,null,null,null,null,null,null,null,null,null,null,null,"Apoio",null,null,null,null,null,null,null,null,null,null,null,null,null,null,null,null,null,null,null,null,null,null,null,null,null,null,null,null,null,null,null,null,null,null,null,null,null,null,null,null,null,null,null,null,null,null,null,null,null,null,null,null,null,null,null,null,null,null,null,null,null,null,null,null,null,null,null,null,null,null,null,null,null,null,null,null,null,null,null,null,null,null,null,null,null,null,null,null,null,null,null,null,null,null,null,null,null,null,null,null,null,null,null,null,null,null,null,null,null,null,null,null,null,null,null,null,null,null,null,null,null,null,null,null,null,null,null,null,null,null,null,null,null,null,null,null,null,null,null,null,null,null,null,null,null,null,null,null,null,null,null,null,null,null,null,null,null,null,null,null,null,null,null,null,null,null,null,null,null,null,null,null,null,null,null,null,null,null,null,null,"Semestral",6,null,null,null,null,23,{"$f":"'Premissas e Calculos'!M54","v":0},null,null,null,null,null,null,null,null,null,null,null,{"$f":"'DADOS DOS EMPREENDIMENTOS'!A30","v":0},{"$f":"'DADOS DOS EMPREENDIMENTOS'!B30","v":0},{"$f":"'DADOS DOS EMPREENDIMENTOS'!C30","v":0}]
[null,"TABELA DE VENDA",null,null,"MÊS DE INÍCIO",null,"DATA INICIAL",null,null,"QTDE PARCELAS",null,null,"PARCELA",null,null,"TOTAL",null,null,"% FLUXO",{"$f":"+P37+P39+P41+P43","v":10409.1},{"$f":"+P65+P67+P69","v":6250},null,null,null,null,{"$f":"+T36-U36","v":4159.1000000000004},null,null,"VALOR PRESENTE",null,null,null,null,null,null,null,null,null,null,null,null,null,null,null,null,null,null,null,null,null,null,null,null,null,null,null,null,null,null,null,null,null,null,null,null,null,null,null,null,null,null,null,null,null,null,null,null,null,null,null,null,null,null,null,null,null,null,null,null,null,null,null,null,null,null,null,null,null,null,null,null,null,null,null,null,null,null,null,null,null,null,null,null,null,null,null,null,null,null,null,null,null,null,null,null,null,null,null,null,null,null,null,null,null,null,null,null,null,null,null,null,null,null,null,null,null,null,null,null,null,null,null,null,null,null,null,null,null,null,null,null,null,null,null,null,null,null,null,null,null,null,null,null,null,null,null,null,null,null,null,null,null,null,null,null,null,null,null,null,null,null,null,null,null,null,null,null,null,null,null,null,null,null,null,null,null,"Anual",12,null,null,null,null,null,null,null,null,null,null,null,null,null,null,null,null,null,{"$f":"'DADOS DOS EMPREENDIMENTOS'!A31","v":0},{"$f":"'DADOS DOS EMPREENDIMENTOS'!B31","v":0},{"$f":"'DADOS DOS EMPREENDIMENTOS'!C31","v":0}]
[{"$f":"VLOOKUP(D37,$GY$34:$GZ$43,2,FALSE)","v":1},null,null,{"$f":"+fluxos!A4","v":"Entrada"},{"$f":"+fluxos!B4","v":0},null,{"$f":"I12","v":"2021-09-01"},null,null,{"$f":"HLOOKUP(CONCATENATE($G$4,J36),fluxos!$B$2:$Y$15,3,FALSE)","v":1},null,null,{"$f":"S6*S37/J37","v":2201.9250000000002},null,null,{"$f":"M37*J37","v":2201.9250000000002},null,null,{"$f":"HLOOKUP(CONCATENATE($G$4,S36),fluxos!$B$2:$Y$15,3,FALSE)","v":1.375E-2},{"$f":"P37+P39+P41","v":8807.7000000000007},{"$f":"P65","v":3000},null,null,null,null,{"$f":"+P65+P67+P69","v":6250},null,null,{"$f":"'Proposta 1 Via'!M16","v":2201.9250000000002},null,null,null,null,null,null,null,null,null,null,null,null,null,null,null,null,null,null,null,null,null,null,null,null,null,null,null,null,null,null,null,null,null,null,null,null,null,null,null,null,null,null,null,null,null,null,null,null,null,null,null,null,null,null,null,null,null,null,null,null,null,null,null,null,null,null,null,null,null,null,null,null,null,null,null,null,null,null,null,null,null,null,null,null,null,null,null,null,null,null,null,null,null,null,null,null,null,null,null,null,null,null,null,null,null,null,null,null,null,null,null,null,null,null,null,null,null,null,null,null,null,null,null,null,null,null,null,null,null,null,null,null,null,null,null,null,null,null,null,null,null,null,null,null,null,null,null,null,null,null,null,null,null,null,null,null,null,null,null,null,null,null,null,null,null,null,null,null,null,null,null,null,null,null,null,null,null,"Mensal 1",null,null,null,null,null,null,null,null,null,null,null,null,null,null,null,null,null,null,{"$f":"'DADOS DOS EMPREENDIMENTOS'!A32","v":0},{"$f":"'DADOS DOS EMPREENDIMENTOS'!B32","v":0},{"$f":"'DADOS DOS EMPREENDIMENTOS'!C32","v":0}]
[null,null,null,null,null,null,null,null,null,null,null,null,null,null,null,null,null,null,null,{"$f":"P37+P39","v":4403.8500000000004},{"$f":"+P65+P67","v":4900},null,null,null,null,null,null,null,null,null,null,null,null,null,null,null,null,null,null,null,null,null,null,null,null,null,null,null,null,null,null,null,null,null,null,null,null,null,null,null,null,null,null,null,null,null,null,null,null,null,null,null,null,null,null,null,null,null,null,null,null,null,null,null,null,null,null,null,null,null,null,null,null,null,null,null,null,null,null,null,null,null,null,null,null,null,null,null,null,null,null,null,null,null,null,null,null,null,null,null,null,null,null,null,null,null,null,null,null,null,null,null,null,null,null,null,null,null,null,null,null,null,null,null,null,null,null,null,null,null,null,null,null,null,null,null,null,null,null,null,null,null,null,null,null,null,null,null,null,null,null,null,null,null,null,null,null,null,null,null,null,null,null,null,null,null,null,null,null,null,null,null,null,null,null,null,null,null,null,null,null,null,null,null,null,null,"Mensal 2"]
[null,null,null,{"$f":"+fluxos!A5","v":"Entrada"},{"$f":"+fluxos!B5","v":1},null,{"$f":"DATE(YEAR(G37),MONTH(G37)+(E39-E37),DAY(G37))","v":"2021-10-01"},null,null,{"$f":"HLOOKUP(CONCATENATE($G$4,J36),fluxos!$B$2:$Y$15,4,FALSE)","v":1},null,null,{"$f":"S6*S39/J39","v":2201.9250000000002},null,null,{"$f":"M39*J39","v":2201.9250000000002},null,null,{"$f":"HLOOKUP(CONCATENATE($G$4,S36),fluxos!$B$2:$Y$15,4,FALSE)","v":1.375E-2},{"$f":"T38-U37","v":1403.8500000000004},{"$f":"IF(T39<0,\"0\",T39)","v":1403.8500000000004},null,null,null,null,{"$f":"+T37-Z37","v":2557.7000000000007},null,null,{"$f":"'Proposta 1 Via'!M17","v":2190.9701168993438},null,null,null,null,null,null,null,null,null,null,null,null,null,null,null,null,null,null,null,null,null,null,null,null,null,null,null,null,null,null,null,null,null,null,null,null,null,null,null,null,null,null,null,null,null,null,null,null,null,null,null,null,null,null,null,null,null,null,null,null,null,null,null,null,null,null,null,null,null,null,null,null,null,null,null,null,null,null,null,null,null,null,null,null,null,null,null,null,null,null,null,null,null,null,null,null,null,null,null,null,null,null,null,null,null,null,null,null,null,null,null,null,null,null,null,null,null,null,null,null,null,null,null,null,null,null,null,null,null,null,null,null,null,null,null,null,null,null,null,null,null,null,null,null,null,null,null,null,null,null,null,null,null,null,null,null,null,null,null,null,null,null,null,null,null,null,null,null,null,null,null,null,null,null,null,null,null,"Mensal 3"]
[null,null,null,null,null,null,null,null,null,null,null,null,null,null,null,null,null,null,null,null,null,null,null,null,null,null,null,null,null,null,null,null,null,null,null,null,null,null,null,null,null,null,null,null,null,null,null,null,null,null,null,null,null,null,null,null,null,null,null,null,null,null,null,null,null,null,null,null,null,null,null,null,null,null,null,null,null,null,null,null,null,null,null,null,null,null,null,null,null,null,null,null,null,null,null,null,null,null,null,null,null,null,null,null,null,null,null,null,null,null,null,null,null,null,null,null,null,null,null,null,null,null,null,null,null,null,null,null,null,null,null,null,null,null,null,null,null,null,null,null,null,null,null,null,null,null,null,null,null,null,null,null,null,null,null,null,null,null,null,null,null,null,null,null,null,null,null,null,null,null,null,null,null,null,null,null,null,null,null,null,null,null,null,null,null,null,null,null,null,null,null,null,null,null,null,null,null,null,null,null,null,null,null,null,null,null,"Mensal 4"]
[null,null,null,{"$f":"+fluxos!A6","v":"Entrada"},{"$f":"+fluxos!B6","v":2},null,{"$f":"DATE(YEAR(G37),MONTH(G37)+(E41-E37),DAY(G37))","v":"2021-11-01"},null,null,{"$f":"HLOOKUP(CONCATENATE($G$4,J36),fluxos!$B$2:$Y$15,5,FALSE)","v":2},null,null,{"$f":"S6*S41/J41","v":2201.9250000000002},null,null,{"$f":"M41*J41","v":4403.8500000000004},null,null,{"$f":"HLOOKUP(CONCATENATE($G$4,S36),fluxos!$B$2:$Y$15,5,FALSE)","v":2.75E-2},{"$f":"+P37+P39+P41","v":8807.7000000000007},{"$f":"T41-U38","v":3907.7000000000007},null,null,null,null,{"$f":"(+Z36-P76)/E76","v":2809.1000000000004},null,null,{"$f":"'Proposta 1 Via'!M18","v":4349.2933216091305},null,null,null,null,null,null,null,null,null,null,null,null,null,null,null,null,null,null,null,null,null,null,null,null,null,null,null,null,null,null,null,null,null,null,null,null,null,null,null,null,null,null,null,null,null,null,null,null,null,null,null,null,null,null,null,null,null,null,null,null,null,null,null,null,null,null,null,null,null,null,null,null,null,null,null,null,null,null,null,null,null,null,null,null,null,null,null,null,null,null,null,null,null,null,null,null,null,null,null,null,null,null,null,null,null,null,null,null,null,null,null,null,null,null,null,null,null,null,null,null,null,null,null,null,null,null,null,null,null,null,null,null,null,null,null,null,null,null,null,null,null,null,null,null,null,null,null,null,null,null,null,null,null,null,null,null,null,null,null,null,null,null,null,null,null,null,null,null,null,null,null,null,null,null,null,null,null,"Mensal Pós Chaves"]
[null,null,null,null,null,null,null,null,null,null,null,null,null,null,null,null,null,null,null,null,{"$f":"U41/3","v":1302.5666666666668},null,null,null,null,{"$f":"+Z41+G76","v":4159.1000000000004},null,null,null,null,null,null,null,null,null,null,null,null,null,null,null,null,null,null,null,null,null,null,null,null,null,null,null,null,null,null,null,null,null,null,null,null,null,null,null,null,null,null,null,null,null,null,null,null,null,null,null,null,null,null,null,null,null,null,null,null,null,null,null,null,null,null,null,null,null,null,null,null,null,null,null,null,null,null,null,null,null,null,null,null,null,null,null,null,null,null,null,null,null,null,null,null,null,null,null,null,null,null,null,null,null,null,null,null,null,null,null,null,null,null,null,null,null,null,null,null,null,null,null,null,null,null,null,null,null,null,null,null,null,null,null,null,null,null,null,null,null,null,null,null,null,null,null,null,null,null,null,null,null,null,null,null,null,null,null,null,null,null,null,null,null,null,null,null,null,null,null,null,null,null,null,null,null,null,null,null,null,null,null,null,null,null,null,null,null,null,null,null,null,null,null,null,null,null,null,{"$f":"'DADOS DOS EMPREENDIMENTOS'!A33","v":0},{"$f":"'DADOS DOS EMPREENDIMENTOS'!B33","v":0},{"$f":"'DADOS DOS EMPREENDIMENTOS'!C33","v":0}]
[{"$f":"VLOOKUP(D43,$GY$34:$GZ$43,2,FALSE)","v":12},null,null,{"$f":"+fluxos!A7","v":"Anual"},{"$f":"+fluxos!B7","v":15},null,{"$f":"DATE(YEAR(G37),MONTH(G37)+(E43-E37),DAY(G37))","v":"2022-12-01"},null,null,{"$f":"HLOOKUP(CONCATENATE($G$4,J36),fluxos!$B$2:$Y$15,6,FALSE)","v":2},null,null,{"$f":"(S6*S43)/J43","v":800.7},null,null,{"$f":"M43*J43","v":1601.4},null,null,{"$f":"HLOOKUP(CONCATENATE($G$4,S36),fluxos!$B$2:$Y$15,6,FALSE)","v":0.01},null,null,null,null,null,null,null,null,null,{"$f":"'Proposta 1 Via'!M19","v":1442.8022953088689},null,null,null,null,null,null,null,null,null,null,null,null,null,null,null,null,null,null,null,null,null,null,null,null,null,null,null,null,null,null,null,null,null,null,null,null,null,null,null,null,null,null,null,null,null,null,null,null,null,null,null,null,null,null,null,null,null,null,null,null,null,null,null,null,null,null,null,null,null,null,null,null,null,null,null,null,null,null,null,null,null,null,null,null,null,null,null,null,null,null,null,null,null,null,null,null,null,null,null,null,null,null,null,null,null,null,null,null,null,null,null,null,null,null,null,null,null,null,null,null,null,null,null,null,null,null,null,null,null,null,null,null,null,null,null,null,null,null,null,null,null,null,null,null,null,null,null,null,null,null,null,null,null,null,null,null,null,null,null,null,null,null,null,null,null,null,null,null,null,null,null,null,null,null,null,null,null,"Entrada",1,null,null,null,null,null,null,null,null,null,null,null,null,null,null,null,null,null,{"$f":"'DADOS DOS EMPREENDIMENTOS'!A34","v":0},{"$f":"'DADOS DOS EMPREENDIMENTOS'!B34","v":0},{"$f":"'DADOS DOS EMPREENDIMENTOS'!C34","v":0}]
[null,null,null,null,null,null,null,null,null,null,null,null,null,null,null,null,null,null,null,null,null,null,null,null,null,null,null,null,null,null,null,null,null,null,null,null,null,null,null,null,null,null,null,null,null,null,null,null,null,null,null,null,null,null,null,null,null,null,null,null,null,null,null,null,null,null,null,null,null,null,null,null,null,null,null,null,null,null,null,null,null,null,null,null,null,null,null,null,null,null,null,null,null,null,null,null,null,null,null,null,null,null,null,null,null,null,null,null,null,null,null,null,null,null,null,null,null,null,null,null,null,null,null,null,null,null,null,null,null,null,null,null,null,null,null,null,null,null,null,null,null,null,null,null,null,null,null,null,null,null,null,null,null,null,null,null,null,null,null,null,null,null,null,null,null,null,null,null,null,null,null,null,null,null,null,null,null,null,null,null,null,null,null,null,null,null,null,null,null,null,null,null,null,null,null,null,null,null,null,null,null,null,null,null,null,null,null,null,null,null,null,null,null,null,null,null,null,null,null,null,null,null,null,null,null,{"$f":"'DADOS DOS EMPREENDIMENTOS'!A35","v":0},{"$f":"'DADOS DOS EMPREENDIMENTOS'!B35","v":0},{"$f":"'DADOS DOS EMPREENDIMENTOS'!C35","v":0}]
[{"$f":"VLOOKUP(D45,$GY$34:$GZ$43,2,FALSE)","v":0},null,null,{"$f":"+fluxos!A8","v":"Mensal 1"},{"$f":"+fluxos!B8","v":4},null,{"$f":"DATE(YEAR(G43),MONTH(G43)+(E45-E43),DAY(G43))","v":"2022-01-01"},null,null,{"$f":"HLOOKUP(CONCATENATE($G$4,J36),fluxos!$B$2:$Y$15,7,FALSE)","v":2},null,null,{"$f":"(S6*S45)/J45","v":240.21},null,null,{"$f":"M45*J45","v":480.42},null,null,{"$f":"HLOOKUP(CONCATENATE($G$4,S36),fluxos!$B$2:$Y$15,7,FALSE)","v":3.0000000000000001E-3},null,null,null,null,null,null,{"$f":"V6*10%/20","v":796.95},null,null,{"$f":"'Proposta 1 Via'!M20","v":469.75901422664555},null,null,null,null,null,null,null,null,null,null,null,null,null,null,null,null,null,null,null,null,null,null,null,null,null,null,null,null,null,null,null,null,null,null,null,null,null,null,null,null,null,null,null,null,null,null,null,null,null,null,null,null,null,null,null,null,null,null,null,null,null,null,null,null,null,null,null,null,null,null,null,null,null,null,null,null,null,null,null,null,null,null,null,null,null,null,null,null,null,null,null,null,null,null,null,null,null,null,null,null,null,null,null,null,null,null,null,null,null,null,null,null,null,null,null,null,null,null,null,null,null,null,null,null,null,null,null,null,null,null,null,null,null,null,null,null,null,null,null,null,null,null,null,null,null,null,null,null,null,null,null,null,null,null,null,null,null,null,null,null,null,null,null,null,null,null,null,null,null,null,null,null,null,null,null,null,null,null,null,null,null,null,null,null,null,null,null,null,null,null,null,null,null,null,null,null,{"$f":"'DADOS DOS EMPREENDIMENTOS'!A36","v":0},{"$f":"'DADOS DOS EMPREENDIMENTOS'!B36","v":0},{"$f":"'DADOS DOS EMPREENDIMENTOS'!C36","v":0}]
[null,null,null,null,null,null,null,null,null,null,null,null,null,null,null,null,null,null,null,null,null,null,null,null,null,null,null,null,null,null,null,null,null,null,null,null,null,null,null,null,null,null,null,null,null,null,null,null,null,null,null,null,null,null,null,null,null,null,null,null,null,null,null,null,null,null,null,null,null,null,null,null,null,null,null,null,null,null,null,null,null,null,null,null,null,null,null,null,null,null,null,null,null,null,null,null,null,null,null,null,null,null,null,null,null,null,null,null,null,null,null,null,null,null,null,null,null,null,null,null,null,null,null,null,null,null,null,null,null,null,null,null,null,null,null,null,null,null,null,null,null,null,null,null,null,null,null,null,null,null,null,null,null,null,null,null,null,null,null,null,null,null,null,null,null,null,null,null,null,null,null,null,null,null,null,null,null,null,null,null,null,null,null,null,null,null,null,null,null,null,null,null,null,null,null,null,null,null,null,null,null,null,null,null,null,null,null,null,null,null,null,null,null,null,null,null,null,null,null,null,null,null,null,null,null,{"$f":"'DADOS DOS EMPREENDIMENTOS'!A37","v":0},{"$f":"'DADOS DOS EMPREENDIMENTOS'!B37","v":0},{"$f":"'DADOS DOS EMPREENDIMENTOS'!C37","v":0}]
[null,null,null,{"$f":"fluxos!A9","v":"Mensal 2"},{"$f":"+fluxos!B9","v":6},null,{"$f":"DATE(YEAR(G45),MONTH(G45)+(E47-E45),DAY(G45))","v":"2022-03-01"},null,null,{"$f":"HLOOKUP(CONCATENATE($G$4,J36),fluxos!$B$2:$Y$15,8,FALSE)","v":9},null,null,{"$f":"(S6*S47)/J47","v":160.14000000000001},null,null,{"$f":"M47*J47","v":1441.2600000000002},null,null,{"$f":"HLOOKUP(CONCATENATE($G$4,S36),fluxos!$B$2:$Y$15,8,FALSE)","v":9.0000000000000011E-3},null,null,null,null,null,null,{"$f":"V6*10%/20","v":796.95},null,null,{"$f":"'Proposta 1 Via'!M21","v":1371.2532269097605}]
[]
[null,null,null,{"$f":"fluxos!A10","v":"Mensal 3"},{"$f":"+fluxos!B10","v":15},null,{"$f":"DATE(YEAR(G47),MONTH(G47)+(E49-E47),DAY(G47))","v":"2022-12-01"},null,null,{"$f":"HLOOKUP(CONCATENATE($G$4,J36),fluxos!$B$2:$Y$15,9,FALSE)","v":7},null,null,{"$f":"(S6*S49)/J49","v":160.14000000000001},null,null,{"$f":"M49*J49","v":1120.98},null,null,{"$f":"HLOOKUP(CONCATENATE($G$4,S36),fluxos!$B$2:$Y$15,9,FALSE)","v":7.0000000000000001E-3},null,null,null,null,null,null,{"$f":"S10*10%/20","v":226.50500000000002},null,null,{"$f":"'Proposta 1 Via'!M22","v":1024.7790625552639}]
[]
[]
[]
[{"$f":"VLOOKUP(D53,$GY$34:$GZ$43,2,FALSE)","v":0},null,null,{"$f":"+fluxos!A11","v":"Mensal 4"},{"$f":"+fluxos!B11","v":22},null,{"$f":"DATE(YEAR(G45),MONTH(G45)+(E53-E45),DAY(G45))","v":"2023-07-01"},null,null,6,null,null,{"$f":"(S6*S53)/J53","v":160.14000000000001},null,null,{"$f":"M53*J53","v":960.84000000000015},null,null,{"$f":"HLOOKUP(CONCATENATE($G$4,S36),fluxos!$B$2:$Y$15,10,FALSE)","v":6.0000000000000001E-3},null,null,null,{"$f":"V6*2%","v":3187.8},null,null,{"$f":"V6*4.5%/2","v":3586.2750000000001},null,null,{"$f":"'Proposta 1 Via'!M23","v":850.35086772175066},null,null,null,null,null,null,null,null,null,null,null,null,null,null,null,null,null,null,null,null,null,null,null,null,null,null,null,null,null,null,null,null,null,null,null,null,null,null,null,null,null,null,null,null,null,null,null,null,null,null,null,null,null,null,null,null,null,null,null,null,null,null,null,null,null,null,null,null,null,null,null,null,null,null,null,null,null,null,null,null,null,null,null,null,null,null,null,null,null,null,null,null,null,null,null,null,null,null,null,null,null,null,null,null,null,null,null,null,null,null,null,null,null,null,null,null,null,null,null,null,null,null,null,null,null,null,null,null,null,null,null,null,null,null,null,null,null,null,null,null,null,null,null,null,null,null,null,null,null,null,null,null,null,null,null,null,null,null,null,null,null,null,null,null,null,null,null,null,null,null,null,null,null,null,null,null,null,null,null,null,null,null,null,null,null,null,null,null,null,null,null,null,null,null,null,null,{"$f":"'DADOS DOS EMPREENDIMENTOS'!A38","v":0},{"$f":"'DADOS DOS EMPREENDIMENTOS'!B38","v":0},{"$f":"'DADOS DOS EMPREENDIMENTOS'!C38","v":0}]
[null,null,null,null,null,null,null,null,null,null,null,null,null,null,null,null,null,null,null,null,null,null,null,null,null,null,null,null,null,null,null,null,null,null,null,null,null,null,null,null,null,null,null,null,null,null,null,null,null,null,null,null,null,null,null,null,null,null,null,null,null,null,null,null,null,null,null,null,null,null,null,null,null,null,null,null,null,null,null,null,null,null,null,null,null,null,null,null,null,null,null,null,null,null,null,null,null,null,null,null,null,null,null,null,null,null,null,null,null,null,null,null,null,null,null,null,null,null,null,null,null,null,null,null,null,null,null,null,null,null,null,null,null,null,null,null,null,null,null,null,null,null,null,null,null,null,null,null,null,null,null,null,null,null,null,null,null,null,null,null,null,null,null,null,null,null,null,null,null,null,null,null,null,null,null,null,null,null,null,null,null,null,null,null,null,null,null,null,null,null,null,null,null,null,null,null,null,null,null,null,null,null,null,null,null,null,null,null,null,null,null,null,null,null,null,null,null,null,null,null,null,null,null,null,null,{"$f":"'DADOS DOS EMPREENDIMENTOS'!A39","v":0},{"$f":"'DADOS DOS EMPREENDIMENTOS'!B39","v":0},{"$f":"'DADOS DOS EMPREENDIMENTOS'!C39","v":0}]
[{"$f":"VLOOKUP(D55,$GY$34:$GZ$43,2,FALSE)","v":{"$error":"#N/A"}},null,null,{"$f":"+fluxos!A12","v":"Chaves"},{"$f":"+fluxos!B12","v":28},null,{"$f":"DATE(YEAR(G53),MONTH(G53)+(E55-E53),DAY(G53))","v":"2024-01-01"},null,null,{"$f":"HLOOKUP(CONCATENATE($G$4,J36),fluxos!$B$2:$Y$15,12,FALSE)","v":1},null,null,{"$f":"(S6*S55)","v":1601.4},null,null,{"$f":"M55*J55","v":1601.4},null,null,{"$f":"HLOOKUP(CONCATENATE($G$4,S36),fluxos!$B$2:$Y$15,11,FALSE)","v":0.01},null,null,null,null,null,null,{"$f":"V6*4.5%","v":7172.55},null,null,{"$f":"'Proposta 1 Via'!M24","v":1392.6754354817863},null,null,null,null,null,null,null,null,null,null,null,null,null,null,null,null,null,null,null,null,null,null,null,null,null,null,null,null,null,null,null,null,null,null,null,null,null,null,null,null,null,null,null,null,null,null,null,null,null,null,null,null,null,null,null,null,null,null,null,null,null,null,null,null,null,null,null,null,null,null,null,null,null,null,null,null,null,null,null,null,null,null,null,null,null,null,null,null,null,null,null,null,null,null,null,null,null,null,null,null,null,null,null,null,null,null,null,null,null,null,null,null,null,null,null,null,null,null,null,null,null,null,null,null,null,null,null,null,null,null,null,null,null,null,null,null,null,null,null,null,null,null,null,null,null,null,null,null,null,null,null,null,null,null,null,null,null,null,null,null,null,null,null,null,null,null,null,null,null,null,null,null,null,null,null,null,null,null,null,null,null,null,null,null,null,null,null,null,null,null,null,null,null,null,null,null,{"$f":"'DADOS DOS EMPREENDIMENTOS'!A40","v":0},{"$f":"'DADOS DOS EMPREENDIMENTOS'!B40","v":0},{"$f":"'DADOS DOS EMPREENDIMENTOS'!C40","v":0}]
[]
[1,null,null,{"$f":"+fluxos!A13","v":"Repasse"},{"$f":"+fluxos!B13","v":3},null,{"$f":"DATE(YEAR(G37),MONTH(G37)+(E57-E37)+0,DAY(G37))","v":"2021-12-01"},null,null,1,null,null,{"$f":"S6-P37-P39-P41-P43-P45-P53-P55-P47-P49","v":144126},null,null,{"$f":"M57*J57","v":144126},null,null,{"$f":"HLOOKUP(CONCATENATE($G$4,S36),fluxos!$B$2:$Y$15,12,FALSE)","v":0.9},null,null,null,null,null,null,null,null,null,{"$f":"'Proposta 1 Via'!M25","v":141985.54379411944},null,null,null,null,null,null,null,null,null,null,null,null,null,null,null,null,null,null,null,null,null,null,null,null,null,null,null,null,null,null,null,null,null,null,null,null,null,null,null,null,null,null,null,null,null,null,null,null,null,null,null,null,null,null,null,null,null,null,null,null,null,null,null,null,null,null,null,null,null,null,null,null,null,null,null,null,null,null,null,null,null,null,null,null,null,null,null,null,null,null,null,null,null,null,null,null,null,null,null,null,null,null,null,null,null,null,null,null,null,null,null,null,null,null,null,null,null,null,null,null,null,null,null,null,null,null,null,null,null,null,null,null,null,null,null,null,null,null,null,null,null,null,null,null,null,null,null,null,null,null,null,null,null,null,null,null,null,null,null,null,null,null,null,null,null,null,null,null,null,null,null,null,null,null,null,null,null,null,null,null,null,null,null,null,null,null,null,null,null,null,null,null,null,null,null,null,{"$f":"'DADOS DOS EMPREENDIMENTOS'!A40","v":0},{"$f":"'DADOS DOS EMPREENDIMENTOS'!B40","v":0},{"$f":"'DADOS DOS EMPREENDIMENTOS'!C40","v":0}]
[null,null,null,null,null,null,null,null,null,null,null,null,null,null,null,null,null,null,null,null,null,null,null,null,null,null,null,null,null,null,null,null,null,null,null,null,null,null,null,null,null,null,null,null,null,null,null,null,null,null,null,null,null,null,null,null,null,null,null,null,null,null,null,null,null,null,null,null,null,null,null,null,null,null,null,null,null,null,null,null,null,null,null,null,null,null,null,null,null,null,null,null,null,null,null,null,null,null,null,null,null,null,null,null,null,null,null,null,null,null,null,null,null,null,null,null,null,null,null,null,null,null,null,null,null,null,null,null,null,null,null,null,null,null,null,null,null,null,null,null,null,null,null,null,null,null,null,null,null,null,null,null,null,null,null,null,null,null,null,null,null,null,null,null,null,null,null,null,null,null,null,null,null,null,null,null,null,null,null,null,null,null,null,null,null,null,null,null,null,null,null,null,null,null,null,null,null,null,null,null,null,null,null,null,null,null,null,null,null,null,null,null,null,null,null,null,null,null,null,null,null,null,null,null,null,{"$f":"'DADOS DOS EMPREENDIMENTOS'!A41","v":0},{"$f":"'DADOS DOS EMPREENDIMENTOS'!B41","v":0},{"$f":"'DADOS DOS EMPREENDIMENTOS'!C41","v":0}]
[null,null,null,null,null,null,12,4,null,7,{"$f":"P59*1.7%","v":2722.38},null,"TOTAL",null,null,{"$f":"SUM(P37,P39,P41,P43,P45,P47,P49,P53,P55,P57)","v":160140},null,null,null,null,null,null,null,null,null,null,null,null,{"$f":"SUM(AC57,AC53,AC45,AC43,AC37,AC39,AC41,AC55,AC47,AC49)","v":157279.35213483198},null,null,null,null,null,null,null,null,null,null,null,null,null,null,null,null,null,null,null,null,null,null,null,null,null,null,null,null,null,null,null,null,null,null,null,null,null,null,null,null,null,null,null,null,null,null,null,null,null,null,null,null,null,null,null,null,null,null,null,null,null,null,null,null,null,null,null,null,null,null,null,null,null,null,null,null,null,null,null,null,null,null,null,null,null,null,null,null,null,null,null,null,null,null,null,null,null,null,null,null,null,null,null,null,null,null,null,null,null,null,null,null,null,null,null,null,null,null,null,null,null,null,null,null,null,null,null,null,null,null,null,null,null,null,null,null,null,null,null,null,null,null,null,null,null,null,null,null,null,null,null,null,null,null,null,null,null,null,null,null,null,null,null,null,null,null,null,null,null,null,null,null,null,null,null,null,null,null,null,null,null,null,null,null,null,null,null,null,null,null,null,null,null,null,null,null,{"$f":"'DADOS DOS EMPREENDIMENTOS'!A42","v":0},{"$f":"'DADOS DOS EMPREENDIMENTOS'!B42","v":0},{"$f":"'DADOS DOS EMPREENDIMENTOS'!C42","v":0}]
[null,null,null,null,null,null,null,null,null,null,null,null,null,null,null,null,null,null,null,null,null,null,null,null,null,null,null,null,null,null,null,null,null,null,null,null,null,null,null,null,null,null,null,null,null,null,null,null,null,null,null,null,null,null,null,null,null,null,null,null,null,null,null,null,null,null,null,null,null,null,null,null,null,null,null,null,null,null,null,null,null,null,null,null,null,null,null,null,null,null,null,null,null,null,null,null,null,null,null,null,null,null,null,null,null,null,null,null,null,null,null,null,null,null,null,null,null,null,null,null,null,null,null,null,null,null,null,null,null,null,null,null,null,null,null,null,null,null,null,null,null,null,null,null,null,null,null,null,null,null,null,null,null,null,null,null,null,null,null,null,null,null,null,null,null,null,null,null,null,null,null,null,null,null,null,null,null,null,null,null,null,null,null,null,null,null,null,null,null,null,null,null,null,null,null,null,null,null,null,null,null,null,null,null,null,null,null,null,null,null,null,null,null,null,null,null,null,null,null,null,null,null,null,null,null,{"$f":"'DADOS DOS EMPREENDIMENTOS'!A43","v":0},{"$f":"'DADOS DOS EMPREENDIMENTOS'!B43","v":0},{"$f":"'DADOS DOS EMPREENDIMENTOS'!C43","v":0}]
[null,null,null,null,null,null,null,null,null,null,null,null,null,null,null,null,null,null,null,null,null,null,null,null,null,null,null,null,null,null,null,null,null,null,null,null,null,null,null,null,null,null,null,null,null,null,null,null,null,null,null,null,null,null,null,null,null,null,null,null,null,null,null,null,null,null,null,null,null,null,null,null,null,null,null,null,null,null,null,null,null,null,null,null,null,null,null,null,null,null,null,null,null,null,null,null,null,null,null,null,null,null,null,null,null,null,null,null,null,null,null,null,null,null,null,null,null,null,null,null,null,null,null,null,null,null,null,null,null,null,null,null,null,null,null,null,null,null,null,null,null,null,null,null,null,null,null,null,null,null,null,null,null,null,null,null,null,null,null,null,null,null,null,null,null,null,null,null,null,null,null,null,null,null,null,null,null,null,null,null,null,null,null,null,null,null,null,null,null,null,null,null,null,null,null,null,null,null,null,null,null,null,null,null,null,null,null,null,null,null,null,null,null,null,null,null,null,null,null,null,null,null,null,null,null,{"$f":"'DADOS DOS EMPREENDIMENTOS'!A44","v":0},{"$f":"'DADOS DOS EMPREENDIMENTOS'!B44","v":0},{"$f":"'DADOS DOS EMPREENDIMENTOS'!C44","v":0}]
[null,null,null,null,null,null,null,null,null,null,null,null,null,null,null,null,null,null,null,null,null,null,null,null,null,{"$f":"CONCATENATE(\"Valor da parcela para zerar o PV\",IF(AJ119>=AR119,\".\",\"\"))","v":{"$error":"#REF!"}},null,null,null,null,null,null,null,null,null,null,null,null,null,null,null,null,null,null,null,null,null,null,null,null,null,null,null,null,null,null,null,null,null,null,null,null,null,null,null,null,null,null,null,null,null,null,null,null,null,null,null,null,null,null,null,null,null,null,null,null,null,null,null,null,null,null,null,null,null,null,null,null,null,null,null,null,null,null,null,null,null,null,null,null,null,null,null,null,null,null,null,null,null,null,null,null,null,null,null,null,null,null,null,null,null,null,null,null,null,null,null,null,null,null,null,null,null,null,null,null,null,null,null,null,null,null,null,null,null,null,null,null,null,null,null,null,null,null,null,null,null,null,null,null,null,null,null,null,null,null,null,null,null,null,null,null,null,null,null,null,null,null,null,null,null,null,null,null,null,null,null,null,null,null,null,null,null,null,null,null,null,null,null,null,null,null,null,null,null,null,null,null,null,null,null,null,null,null,null,{"$f":"'DADOS DOS EMPREENDIMENTOS'!A45","v":0},{"$f":"'DADOS DOS EMPREENDIMENTOS'!B45","v":0},{"$f":"'DADOS DOS EMPREENDIMENTOS'!C45","v":0}]
[null,"PROPOSTA CLIENTE ",null,null,"QTDE PARCELAS",null,"PARCELA",null,null,null,"MÊS DE INÍCIO",null,"DATA INICIAL",null,null,"TOTAL",null,null,null,null,null,null,null,null,null,null,null,null,null,null,null,null,null,null,null,null,null,null,null,null,null,null,null,null,null,null,null,null,null,null,null,null,null,null,null,null,null,null,null,null,null,null,null,null,null,null,null,null,null,null,null,null,null,null,null,null,null,null,null,null,null,null,null,null,null,null,null,null,null,null,null,null,null,null,null,null,null,null,null,null,null,null,null,null,null,null,null,null,null,null,null,null,null,null,null,null,null,null,null,null,null,null,null,null,null,null,null,null,null,null,null,null,null,null,null,null,null,null,null,null,null,null,null,null,null,null,null,null,null,null,null,null,null,null,null,null,null,null,null,null,null,null,null,null,null,null,null,null,null,null,null,null,null,null,null,null,null,null,null,null,null,null,null,null,null,null,null,null,null,null,null,null,null,null,null,null,null,null,null,null,null,null,null,null,null,null,null,null,null,null,null,null,null,null,null,null,null,null,null,null,null,null,null,null,null,{"$f":"'DADOS DOS EMPREENDIMENTOS'!A46","v":0},{"$f":"'DADOS DOS EMPREENDIMENTOS'!B46","v":0},{"$f":"'DADOS DOS EMPREENDIMENTOS'!C46","v":0}]
[null,null,null,null,null,null,null,null,null,null,"MÊS DE INÍCIO",null,null,null,null,null,null,null,null,null,null,null,null,null,null,null,null,null,null,null,null,"VALOR PRESENTE",null,null,null,null,null,null,null,null,null,null,null,null,null,null,null,null,null,null,null,null,null,null,null,null,null,null,null,null,null,null,null,null,null,null,null,null,null,null,null,null,null,null,null,null,null,null,null,null,null,null,null,null,null,null,null,null,null,null,null,null,null,null,null,null,null,null,null,null,null,null,null,null,null,null,null,null,null,null,null,null,null,null,null,null,null,null,null,null,null,null,null,null,null,null,null,null,null,null,null,null,null,null,null,null,null,null,null,null,null,null,null,null,null,null,null,null,null,null,null,null,null,null,null,null,null,null,null,null,null,null,null,null,null,null,null,null,null,null,null,null,null,null,null,null,null,null,null,null,null,null,null,null,null,null,null,null,null,null,null,null,null,null,null,null,null,null,null,null,null,null,null,null,null,null,null,null,null,null,null,null,null,null,null,null,null,null,null,null,null,null,null,null,null,{"$f":"'DADOS DOS EMPREENDIMENTOS'!A47","v":0},{"$f":"'DADOS DOS EMPREENDIMENTOS'!B47","v":0},{"$f":"'DADOS DOS EMPREENDIMENTOS'!C47","v":0}]
[{"$f":"VLOOKUP(D65,$GY$34:$GZ$43,2,FALSE)","v":1},null,null,"Entrada",1,null,3000,null,null,null,0,null,{"$f":"G37","v":"2021-09-01"},null,null,{"$f":"G65*E65","v":3000},null,null,{"$f":"IF(E65<>0,IF(P65<'Simulador CEF'!P37,CONCATENATE(\"1ª parcela do ato insuficiente, mínimo de R$ \",'Simulador CEF'!M37,\" \nnessa parcela.\"),IF(E65>J37, CONCATENATE(\"Parcela no máximo em \",J37,\" vez\"),\"OK\")),\"Informar Entrada\")","v":"OK"},null,null,null,null,null,null,{"$f":"IF('Proposta 1 Via'!P43>0,'Proposta 1 Via'!P43,0)","v":3019.9778315745348},null,null,null,null,null,{"$f":"'Proposta 1 Via'!M43","v":3000}]
[null,null,null,null,null,null,null,null,null,null,null,null,null,null,null,null,null,null,null,null,null,null,null,null,null,null,null,null,null,null,null,null,null,null,null,null,null,null,null,null,null,null,null,null,null,null,null,null,null,null,null,null,null,null,null,null,null,null,null,null,null,null,null,null,null,null,null,null,null,null,null,null,null,null,null,null,null,null,null,null,null,null,null,null,null,null,null,null,null,null,null,null,null,null,null,null,null,null,null,null,null,null,null,null,null,null,null,null,null,null,null,null,null,null,null,null,null,null,null,null,null,null,null,null,null,null,null,null,null,null,null,null,null,null,null,null,null,null,null,null,null,null,null,null,null,null,null,null,null,null,null,null,null,null,null,null,null,null,null,null,null,null,null,null,null,null,null,null,null,null,null,null,null,null,null,null,null,null,null,null,null,null,null,null,null,null,null,null,null,null,null,null,null,null,null,null,null,null,null,null,null,null,null,null,null,null,null,null,null,null,null,null,24]
[{"$f":"VLOOKUP(D76,$GY$34:$GZ$43,2,FALSE)","v":1},null,null,"Entrada",1,null,1900,null,null,null,1,null,{"$f":"DATE(YEAR(M65),MONTH(M65)+(K67-K65),DAY(M65))","v":"2021-10-01"},null,null,{"$f":"G67*E67","v":1900},null,null,{"$f":"IF(E67<>0,IF(P67<'Simulador CEF'!T39,CONCATENATE(\"parcela de entrada insuficiente, mínimo de R$ \",'Simulador CEF'!T39,\" \nnessa parcela.\"),IF(E67>J39, CONCATENATE(\"Parcela no máximo em \",J39,\" vez\"),\"OK\")),\"Informar Entrada\")","v":"OK"},null,null,null,null,null,null,{"$f":"IF('Proposta 1 Via'!P44>0,'Proposta 1 Via'!P44,0)","v":1920.0777210288984},null,null,null,null,null,{"$f":"'Proposta 1 Via'!M44","v":1890.5472357635947}]
[]
[{"$f":"VLOOKUP(D78,$GY$34:$GZ$43,2,FALSE)","v":0},null,null,"Entrada",1,null,1350,null,null,null,2,null,{"$f":"DATE(YEAR(M65),MONTH(M65)+(K69-K65),DAY(M65))","v":"2021-11-01"},null,null,{"$f":"G69*E69","v":1350},null,null,{"$f":"IF(E69<>0,IF(P69<'Simulador CEF'!U42,CONCATENATE(\"parcela de entrada insuficiente, mínimo de R$ \",'Simulador CEF'!U42,\" \nnessa parcela.\"),IF(E69>J41, CONCATENATE(\"Parcela no máximo em \",J41,\" vez\"),\"OK\")),\"Informar Entrada\")","v":"OK"},null,null,null,null,null,null,{"$f":"IF('Proposta 1 Via'!P45>0,'Proposta 1 Via'!P45,0)","v":1370.1781099320162},null,null,null,null,null,{"$f":"'Proposta 1 Via'!M45","v":1336.6005397180188}]
[]
[]
[]
[]
[]
[]
[{"$f":"VLOOKUP(D80,$GY$34:$GZ$43,2,FALSE)","v":0},null,null,"Entrada",1,null,1350,null,null,null,3,null,{"$f":"DATE(YEAR(M65),MONTH(M65)+(K76-K65),DAY(M65))","v":"2021-12-01"},null,null,{"$f":"G76*E76","v":1350},null,null,{"$f":"IF(E76<>0,IF(P76<'Simulador CEF'!U42,CONCATENATE(\"parcela de entrada insuficiente, mínimo de R$ \",'Simulador CEF'!U42,\" \nnessa parcela.\"),IF(E76>G59, CONCATENATE(\"Parcela no máximo em \",G59,\" vezes\"),\"OK\")),\"Informar Entrada\")","v":"OK"},null,null,null,null,null,null,{"$f":"IF('Proposta 1 Via'!P46>0,'Proposta 1 Via'!P46,0)","v":1370.2790007811393},null,null,null,null,null,{"$f":"'Proposta 1 Via'!M46","v":1329.950766149489}]
[null,null,null,null,null,null,null,null,null,null,null,null,null,null,null,null,null,null,null,null,null,null,null,null,null,null,null,null,"pro-soluto"]
[{"$f":"VLOOKUP(D86,$GY$34:$GZ$43,2,FALSE)","v":{"$error":"#N/A"}},null,null,"Mensal 1",{"$f":"fluxos!C8","v":2},null,550,null,null,null,4,null,{"$f":"DATE(YEAR(M67),MONTH(M67)+(K78-K67),DAY(M67))","v":"2022-01-01"},null,null,{"$f":"G78*E78","v":1100},null,null,{"$f":"IF(E78<>0,IF(G78>'Simulador CEF'!F20*35%,CONCATENATE(\"valor excedente, máximo de R$ \",'Simulador CEF'!F20*35%,\" \npor parcela.\"),IF(E78>J45, CONCATENATE(\"Parcele no máximo em \",J45,\" vezes\"),\"OK\")),\"Informar Entrada\")","v":"OK"},null,null,null,null,null,{"$f":"IF(G78<F20*35%,\"Menor que 35%\",\"\")","v":"Menor que 35%"},{"$f":"IF('Proposta 1 Via'!P47>0,'Proposta 1 Via'!P47,0)","v":560.21561008343815},null,"sim",{"$f":"+P78/V6","v":6.901311249137336E-3},null,null,{"$f":"'Proposta 1 Via'!M47","v":1075.5899330779528}]
[null,null,null,null,null,null,null,null,null,null,null,null,null,null,null,null,null,null,null,null,null,null,null,null,null,null,null,"não"]
[{"$f":"VLOOKUP(#REF!,$GY$34:$GZ$43,2,FALSE)","v":{"$error":"#REF!"}},null,null,"Mensal 2",{"$f":"fluxos!C9","v":9},null,400,null,null,null,{"$f":"E47","v":6},null,{"$f":"DATE(YEAR(M78),MONTH(M78)+(K80-K78),DAY(M78))","v":"2022-03-01"},null,null,{"$f":"G80*E80","v":3600},null,null,{"$f":"IF(G4=\"Único Suzano - Fase 1 - Torres 1, 2 3 e 7\",\"Parcelas Somente para fase 2\",IF(E80<>0,IF(G80>'Simulador CEF'!N32,CONCATENATE(\"valor excedente, máximo de R$ \",'Simulador CEF'!N32,\" \npor parcela.\"),IF(E80>J47,CONCATENATE(\"Parcele no máximo em \",J47,\" vezes\"),\"OK\")),\"Informar Entrada\"))","v":"OK"},null,null,null,null,null,{"$f":"IF(G80<F20*30%,\"Menor que 30%\",\"\")","v":"Menor que 30%"},{"$f":"IF('Proposta 1 Via'!P48>0,'Proposta 1 Via'!P48,0)","v":402.33308471809926},null,null,null,null,null,{"$f":"'Proposta 1 Via'!M48","v":3425.1360732103421},null,null,null,null,null,null,null,null,null,null,null,null,null,null,null,null,null,null,null,null,null,null,null,null,null,null,null,null,null,null,null,null,null,null,null,null,null,null,null,null,null,null,null,null,null,null,null,null,null,null,null,null,null,null,null,null,null,null,null,null,null,null,null,null,null,null,null,null,null,null,null,null,null,null,null,null,null,null,null,null,null,null,null,null,null,null,null,null,null,null,null,null,null,null,null,null,null,null,null,null,null,null,null,null,null,null,null,null,null,null,null,null,null,null,null,null,null,null,null,null,null,null,null,null,null,null,null,null,null,null,null,null,null,null,null,null,null,null,null,null,null,null,null,null,null,null,null,null,null,null,null,null,null,null,null,null,null,null,null,null,null,null,null,null,null,null,null,null,null,null,null,null,null,null,null,null,null,null,null,null,25,null,null,null,null,null,null,null,null,null,null,null,null,null,null,null,null,null,null,null,null,null,null,null,null,null,null,null,null,null,null,null,null,null,null,null,null,"RENDA","PRAZO"]
[null,null,null,null,null,null,null,null,null,null,null,null,null,null,null,null,null,null,null,null,null,null,null,null,null,null,null,"não"]
[{"$f":"VLOOKUP(#REF!,$GY$34:$GZ$43,2,FALSE)","v":{"$error":"#REF!"}},null,null,"Mensal 3",{"$f":"fluxos!C10","v":7},null,300,null,null,null,{"$f":"E49","v":15},null,{"$f":"DATE(YEAR(M80),MONTH(M80)+(K82-K80),DAY(M80))","v":"2022-12-01"},null,null,{"$f":"G82*E82","v":2100},null,null,{"$f":"IF(E82<>0,IF(G82>'Simulador CEF'!F20*25%,CONCATENATE(\"valor excedente, máximo de R$ \",'Simulador CEF'!F20*25%,\" \npor parcela.\"),IF(E82>J49,CONCATENATE(\"Parcele no máximo em \",J49,\" vezes\"),\"OK\")),\"Informar Entrada\")","v":"OK"},null,null,null,null,null,{"$f":"IF(G82<F20*25%,\"Menor que 25%\",\"\")","v":"Menor que 25%"},{"$f":"IF('Proposta 1 Via'!P49>0,'Proposta 1 Via'!P49,0)","v":303.12189238172812},null,null,null,null,null,{"$f":"'Proposta 1 Via'!M49","v":1919.7809339738922},null,null,null,null,null,null,null,null,null,null,null,null,null,null,null,null,null,null,null,null,null,null,null,null,null,null,null,null,null,null,null,null,null,null,null,null,null,null,null,null,null,null,null,null,null,null,null,null,null,null,null,null,null,null,null,null,null,null,null,null,null,null,null,null,null,null,null,null,null,null,null,null,null,null,null,null,null,null,null,null,null,null,null,null,null,null,null,null,null,null,null,null,null,null,null,null,null,null,null,null,null,null,null,null,null,null,null,null,null,null,null,null,null,null,null,null,null,null,null,null,null,null,null,null,null,null,null,null,null,null,null,null,null,null,null,null,null,null,null,null,null,null,null,null,null,null,null,null,null,null,null,null,null,null,null,null,null,null,null,null,null,null,null,null,null,null,null,null,null,null,null,null,null,null,null,null,null,null,null,null,25,null,null,null,null,null,null,null,null,null,null,null,null,null,null,null,null,null,null,null,null,null,null,null,null,null,null,null,null,null,null,null,null,null,null,null,null,"RENDA","PRAZO"]
[null,null,null,null,null,null,null,null,null,null,null,null,null,null,null,null,null,null,null,null,null,null,null,null,null,null,null,"não"]
[{"$f":"VLOOKUP(#REF!,$GY$34:$GZ$43,2,FALSE)","v":{"$error":"#REF!"}},null,null,"Mensal 4",{"$f":"fluxos!C11","v":6},null,200,null,null,null,{"$f":"E53","v":22},null,{"$f":"DATE(YEAR(M82),MONTH(M82)+(K84-K82),DAY(M82))","v":"2023-07-01"},null,null,{"$f":"G84*E84","v":1200},null,null,{"$f":"IF(E84<>0,IF(G84>'Simulador CEF'!F20*20%,CONCATENATE(\"valor excedente, máximo de R$ \",'Simulador CEF'!F20*20%,\" \npor parcela.\"),IF(E84>J53,CONCATENATE(\"Parcele no máximo em \",J53,\" vezes\"),\"OK\")),\"Informar Entrada\")","v":"OK"},null,null,null,null,null,{"$f":"IF(G84<F20*20%,\"Menor que 20%\",\"\")","v":"Menor que 20%"},{"$f":"IF('Proposta 1 Via'!P50>0,'Proposta 1 Via'!P50,0)","v":203.7622704577436},null,null,null,null,null,{"$f":"'Proposta 1 Via'!M50","v":1062.0093264915083},null,null,null,null,null,null,null,null,null,null,null,null,null,null,null,null,null,null,null,null,null,null,null,null,null,null,null,null,null,null,null,null,null,null,null,null,null,null,null,null,null,null,null,null,null,null,null,null,null,null,null,null,null,null,null,null,null,null,null,null,null,null,null,null,null,null,null,null,null,null,null,null,null,null,null,null,null,null,null,null,null,null,null,null,null,null,null,null,null,null,null,null,null,null,null,null,null,null,null,null,null,null,null,null,null,null,null,null,null,null,null,null,null,null,null,null,null,null,null,null,null,null,null,null,null,null,null,null,null,null,null,null,null,null,null,null,null,null,null,null,null,null,null,null,null,null,null,null,null,null,null,null,null,null,null,null,null,null,null,null,null,null,null,null,null,null,null,null,null,null,null,null,null,null,null,null,null,null,null,null,25,null,null,null,null,null,null,null,null,null,null,null,null,null,null,null,null,null,null,null,null,null,null,null,null,null,null,null,null,null,null,null,null,null,null,null,null,"RENDA","PRAZO"]
[null,null,null,null,null,null,null,null,null,null,null,null,null,null,null,null,null,null,null,null,null,null,null,null,null,null,null,null,null,null,null,null,null,null,null,null,null,null,null,null,null,null,null,null,null,null,null,null,null,null,null,null,null,null,null,null,null,null,null,null,null,null,null,null,null,null,null,null,null,null,null,null,null,null,null,null,null,null,null,null,null,null,null,null,null,null,null,null,null,null,null,null,null,null,null,null,null,null,null,null,null,null,null,null,null,null,null,null,null,null,null,null,null,null,null,null,null,null,null,null,null,null,null,null,null,null,null,null,null,null,null,null,null,null,null,null,null,null,null,null,null,null,null,null,null,null,null,null,null,null,null,null,null,null,null,null,null,null,null,null,null,null,null,null,null,null,null,null,null,null,null,null,null,null,null,null,null,null,null,null,null,null,null,null,null,null,null,null,null,null,null,null,null,null,null,null,null,null,null,null,null,null,null,null,null,null,null,null,null,null,null,null,26,null,null,null,null,null,null,null,null,null,null,null,null,null,null,null,null,null,null,null,null,null,null,null,null,null,null,null,null,null,null,null,null,null,null,null,null,2790,300]
[{"$f":"VLOOKUP(#REF!,$GY$34:$GZ$43,2,FALSE)","v":{"$error":"#REF!"}},null,null,"Única",1,null,1070,null,null,null,{"$f":"+E55","v":28},null,{"$f":"DATE(YEAR(M80),MONTH(M80)+(K86-K80),DAY(M80))","v":"2024-01-01"},null,null,{"$f":"G86*E86","v":1070},null,null,{"$f":"IF(E86<>0,IF(G86>'Simulador CEF'!F23,CONCATENATE(\"valor excedente, máximo de R$ \",'Simulador CEF'!F23,\" \npor parcela.\"),IF(E86>J55, CONCATENATE(\"Parcele no máximo em \",J55,\" vezes\"),\"OK\")),\"Informar Entrada\")","v":"OK"},null,null,null,null,null,null,{"$f":"IF('Proposta 1 Via'!P51>0,'Proposta 1 Via'!P51,0)","v":1092.9719708328114},null,null,null,null,null,{"$f":"'Proposta 1 Via'!M51","v":930.53747718590682},null,null,null,null,null,null,null,null,null,null,null,null,null,null,null,null,null,null,null,null,null,null,null,null,null,null,null,null,null,null,null,null,null,null,null,null,null,null,null,null,null,null,null,null,null,null,null,null,null,null,null,null,null,null,null,null,null,null,null,null,null,null,null,null,null,null,null,null,null,null,null,null,null,null,null,null,null,null,null,null,null,null,null,null,null,null,null,null,null,null,null,null,null,null,null,null,null,null,null,null,null,null,null,null,null,null,null,null,null,null,null,null,null,null,null,null,null,null,null,null,null,null,null,null,null,null,null,null,null,null,null,null,null,null,null,null,null,null,null,null,null,null,null,null,null,null,null,null,null,null,null,null,null,null,null,null,null,null,null,null,null,null,null,null,null,null,null,null,null,null,null,null,null,null,null,null,null,null,null,null,27,null,null,null,null,null,null,null,null,null,null,null,null,null,null,null,null,null,null,null,null,null,null,null,null,null,null,null,null,null,null,null,null,null,null,null,null,4900,360]
[null,null,null,null,null,null,null,null,null,null,null,null,null,null,null,null,null,null,null,null,null,null,null,null,null,null,null,null,null,null,null,null,null,null,null,null,null,null,null,null,null,null,null,null,null,null,null,null,null,null,null,null,null,null,null,null,null,null,null,null,null,null,null,null,null,null,null,null,null,null,null,null,null,null,null,null,null,null,null,null,null,null,null,null,null,null,null,null,null,null,null,null,null,null,null,null,null,null,null,null,null,null,null,null,null,null,null,null,null,null,null,null,null,null,null,null,null,null,null,null,null,null,null,null,null,null,null,null,null,null,null,null,null,null,null,null,null,null,null,null,null,null,null,null,null,null,null,null,null,null,null,null,null,null,null,null,null,null,null,null,null,null,null,null,null,null,null,null,null,null,null,null,null,null,null,null,null,null,null,null,null,null,null,null,null,null,null,null,null,null,null,null,null,null,null,null,null,null,null,null,null,null,null,null,null,null,null,null,null,null,null,null,28]
[{"$f":"VLOOKUP(D88,$GY$34:$GZ$43,2,FALSE)","v":12},null,null,"Anual",2,null,2000,null,null,null,{"$f":"E43","v":15},null,{"$f":"DATE(YEAR(M86),MONTH(M86)+(K88-K86),DAY(M86))","v":"2022-12-01"},null,null,{"$f":"G88*E88","v":4000},null,null,{"$f":"IF(E88<>0,IF(G88>'Simulador CEF'!F20,CONCATENATE(\"valor excedente, máximo de R$ \",'Simulador CEF'!F20,\" \npor parcela.\"),IF(E88>J43, CONCATENATE(\"Parcele no máximo em \",J43,\" vezes\"),\"OK\")),\"Informar Entrada\")","v":"OK"},null,null,null,null,null,null,{"$f":"IF('Proposta 1 Via'!P50>0,'Proposta 1 Via'!P50,0)","v":203.7622704577436},null,null,null,null,null,{"$f":"'Proposta 1 Via'!M52","v":3603.8523674506528},null,null,null,null,null,null,null,null,null,null,null,null,null,null,null,null,null,null,null,null,null,null,null,null,null,null,null,null,null,null,null,null,null,null,null,null,null,null,null,null,null,null,null,null,null,null,null,null,null,null,null,null,null,null,null,null,null,null,null,null,null,null,null,null,null,null,null,null,null,null,null,null,null,null,null,null,null,null,null,null,null,null,null,null,null,null,null,null,null,null,null,null,null,null,null,null,null,null,null,null,null,null,null,null,null,null,null,null,null,null,null,null,null,null,null,null,null,null,null,null,null,null,null,null,null,null,null,null,null,null,null,null,null,null,null,null,null,null,null,null,null,null,null,null,null,null,null,null,null,null,null,null,null,null,null,null,null,null,null,null,null,null,null,null,null,null,null,null,null,null,null,null,null,null,null,null,null,null,null,null,29]
[null,null,null,null,null,null,null,null,null,null,null,null,null,null,null,null,null,null,null,null,null,null,null,null,null,null,null,null,null,null,null,null,null,null,null,null,null,null,null,null,null,null,null,null,null,null,null,null,null,null,null,null,null,null,null,null,null,null,null,null,null,null,null,null,null,null,null,null,null,null,null,null,null,null,null,null,null,null,null,null,null,null,null,null,null,null,null,null,null,null,null,null,null,null,null,null,null,null,null,null,null,null,null,null,null,null,null,null,null,null,null,null,null,null,null,null,null,null,null,null,null,null,null,null,null,null,null,null,null,null,null,null,null,null,null,null,null,null,null,null,null,null,null,null,null,null,null,null,null,null,null,null,null,null,null,null,null,null,null,null,null,null,null,null,null,null,null,null,null,null,null,null,null,null,null,null,null,null,null,null,null,null,null,null,null,null,null,null,null,null,null,null,null,null,null,null,null,null,null,null,null,null,null,null,null,null,null,null,null,null,null,null,30]
[{"$f":"VLOOKUP(D90,$GY$34:$GZ$43,2,FALSE)","v":0},null,null,"Mensal Pós Chaves",12,null,0,null,null,null,38,null,{"$f":"DATE(YEAR(M88),MONTH(M88)+(K90-K88),DAY(M88))","v":"2024-11-01"},null,null,{"$f":"G90*E90","v":0},null,null,{"$f":"IF(E90<>0,IF(G90>'Simulador CEF'!F20,CONCATENATE(\"valor excedente, máximo de R$ \",'Simulador CEF'!F20,\" \npor parcela.\"),IF(E90>G59, CONCATENATE(\"Parcele no máximo em \",G59,\" vezes\"),\"OK\")),\"Informar Entrada\")","v":"OK"},null,null,null,null,null,null,{"$f":"IF('Proposta 1 Via'!P52>0,'Proposta 1 Via'!P52,0)","v":2011.0869311711901},null,null,null,null,null,{"$f":"'Proposta 1 Via'!M53","v":0},null,null,null,null,"Valor Máximo de Chaves"]
[null,null,null,null,null,null,null,null,null,null,null,null,null,null,null,null,null,null,null,null,null,null,null,null,null,null,null,null,null,null,null,null,null,null,null,null,null,null,null,null,null,null,null,null,null,null,null,null,null,null,null,null,null,null,null,null,null,null,null,null,null,null,null,null,null,null,null,null,null,null,null,null,null,null,null,null,null,null,null,null,null,null,null,null,null,null,null,null,null,null,null,null,null,null,null,null,null,null,null,null,null,null,null,null,null,null,null,null,null,null,null,null,null,null,null,null,null,null,null,null,null,null,null,null,null,null,null,null,null,null,null,null,null,null,null,null,null,null,null,null,null,null,null,null,null,null,null,null,null,null,null,null,null,null,null,null,null,null,null,null,null,null,null,null,null,null,null,null,null,null,null,null,null,null,null,null,null,null,null,null,null,null,null,null,null,null,null,null,null,null,null,null,null,null,null,null,null,null,null,null,null,null,null,null,null,null,null,null,null,null,null,null,null,null,null,null,null,null,null,null,null,null,null,null,null,null,null,null,null,null,null,null,null,null,null,null,null,null,null,null,null,null,null,null,null,null,null,null,"Prazo","DIA","MÊS","ANO",null,"IDADE EM MESES"]
[1,null,null,"Única",1,null,100,null,null,null,37,null,{"$f":"DATE(YEAR(M90),MONTH(M90)+(K92-K90),DAY(M90))","v":"2024-10-01"},null,null,{"$f":"G92*E92","v":100},null,null,{"$f":"IF(SUM(P94:R95)>S32,\"Financiamento superior ao permitido na tabela\",\"ok\")","v":"ok"},null,null,null,null,null,null,{"$f":"IF('Proposta 1 Via'!P54>0,'Proposta 1 Via'!P54,0)","v":22031.279000781138},null,"Zerar PV",null,null,null,{"$f":"'Proposta 1 Via'!M54","v":21684.10838053067},null,null,null,null,{"$f":"(P97-P95-P94)*'Premissas e Calculos'!G35","v":6231},null,null,null,null,null,null,null,null,null,null,null,null,null,null,null,null,null,null,null,null,null,null,null,null,null,null,null,null,null,null,null,null,null,null,null,null,null,null,null,null,null,null,null,null,null,null,null,null,null,null,null,null,null,null,null,null,null,null,null,null,null,null,null,null,null,null,null,null,null,null,null,null,null,null,null,null,null,null,null,null,null,null,null,null,null,null,null,null,null,null,null,null,null,null,null,null,null,null,null,null,null,null,null,null,null,null,null,null,null,null,null,null,null,null,null,null,null,null,null,null,null,null,null,null,null,null,null,null,null,null,null,null,null,null,null,null,null,null,null,null,null,null,null,null,null,null,null,null,null,null,null,null,null,null,null,null,null,null,null,null,null,null,null,null,null,null,null,null,null,null,null,null,null,null,null,null,null,null,null,null,null,null,{"$f":"Apoio!B31","v":0},{"$f":"Apoio!C31","v":0},{"$f":"Apoio!D31","v":0},{"$f":"Apoio!E31","v":0},null,null,null,null,null,null,null,null,null,null,null,null,null,null,null,null,null,null,null,null,null,null,null,null,null,120,1,1,1928,null,{"$f":"CONCATENATE(S16,\"/\",T16,\"/\",U16)","v":"19/5/1994"},{"$f":"TODAY()+120","v":"2021-12-30"},{"$f":"ROUND((IU92-IT92)/30,0)","v":336}]
[null,null,null,null,null,null,null,null,null,null,null,null,null,null,null,null,null,null,null,null,null,null,null,null,null,null,null,null,null,null,null,null,null,null,null,null,null,null,null,null,null,null,null,null,null,null,null,null,null,null,null,null,null,null,null,null,null,null,null,null,null,null,null,null,null,null,null,null,null,null,null,null,null,null,null,null,null,null,null,null,null,null,null,null,null,null,null,null,null,null,null,null,null,null,null,null,null,null,null,null,null,null,null,null,null,null,null,null,null,null,null,null,null,null,null,null,null,null,null,null,null,null,null,null,null,null,null,null,null,null,null,null,null,null,null,null,null,null,null,null,null,null,null,null,null,null,null,null,null,null,null,null,null,null,null,null,null,null,null,null,null,null,null,null,null,null,null,null,null,null,null,null,null,null,null,null,null,null,null,null,null,null,null,null,null,null,null,null,null,null,null,null,null,null,null,null,null,null,null,null,null,null,null,null,null,null,null,null,null,null,null,null,null,null,null,null,null,null,null,{"$f":"Apoio!B32","v":"Fluxo de Juros da CAIXA"},null,null,null,null,null,null,null,null,null,null,null,null,null,null,null,null,null,null,null,null,null,null,null,null,null,null,null,null,{"$f":"IO92+60","v":180},2,2,1929]
[null,null,null,"Repasse","FGTS + SUBSÍDIO ",null,null,null,null,null,{"$f":"AN149","v":3},null,{"$f":"G57","v":"2021-12-01"},null,null,{"$f":"S24+S20+S30","v":22011},null,null,null,"Zerar PV no Financiamento?",null,null,null,null,null,null,null,{"$f":"'Proposta 1 Via'!Q67","v":117770.27900078111},null,null,null,null,null,null,null,null,null,null,null,null,null,null,null,null,null,null,null,null,null,null,null,null,null,null,null,null,null,null,null,null,null,null,null,null,null,null,null,null,null,null,null,null,null,null,null,null,null,null,null,null,null,null,null,null,null,null,null,null,null,null,null,null,null,null,null,null,null,null,null,null,null,null,null,null,null,null,null,null,null,null,null,null,null,null,null,null,null,null,null,null,null,null,null,null,null,null,null,null,null,null,null,null,null,null,null,null,null,null,null,null,null,null,null,null,null,null,null,null,null,null,null,null,null,null,null,null,null,null,null,null,null,null,null,null,null,null,null,null,null,null,null,null,null,null,null,null,null,null,null,null,null,null,null,null,null,null,null,null,null,null,null,null,null,null,null,null,null,null,null,null,null,null,null,null,null,null,null,null,null,null,null,null,null,null,null,null,null,null,null,null,null,null,null,null,null,null,null,null,null,null,null,null,null,null,null,null,null,null,null,null,null,null,null,null,null,null,null,null,{"$f":"IO93+60","v":240},3,3,1930]
[null,null,null,null,"FINANCIAMENTO",null,null,null,null,null,null,null,null,null,null,{"$f":"IF(S26<AB94,S26,IF(T95=\"sim\",AB94,S26))","v":117750},null,null,null,"sim",{"$f":"IF(S32<AB94,\"Limite Atingido\", \"Possível\")","v":"Possível"},null,null,null,null,{"$f":"'Proposta 1 Via'!P55","v":117770.27900078113},null,"select",null,null,null,{"$f":"'Proposta 1 Via'!M55","v":116001.26126970543},null,null,null,null,null,null,null,null,null,null,null,null,null,null,null,null,null,null,null,null,null,null,null,null,null,null,null,null,null,null,null,null,null,null,null,null,null,null,null,null,null,null,null,null,null,null,null,null,null,null,null,null,null,null,null,null,null,null,null,null,null,null,null,null,null,null,null,null,null,null,null,null,null,null,null,null,null,null,null,null,null,null,null,null,null,null,null,null,null,null,null,null,null,null,null,null,null,null,null,null,null,null,null,null,null,null,null,null,null,null,null,null,null,null,null,null,null,null,null,null,null,null,null,null,null,null,null,null,null,null,null,null,null,null,null,null,null,null,null,null,null,null,null,null,null,null,null,null,null,null,null,null,null,null,null,null,null,null,null,null,null,null,null,null,null,null,null,null,null,null,null,null,null,null,null,null,null,null,null,null,null,null,null,null,null,null,null,{"$f":"Apoio!B33","v":"Taxa de Juros"},{"$f":"Apoio!C33","v":0},{"$f":"Apoio!D33","v":0.05},{"$f":"Apoio!E33","v":"Código"},null,null,null,null,null,null,null,null,null,null,null,null,null,null,null,null,null,null,null,null,null,null,null,null,null,{"$f":"IO94+60","v":300},4,4,1931]
[null,null,null,null,{"$f":"IF(SUM(P78,P80,P86,P82,P84,P88)>V6*12.5%,\"Pró-Soluto acima do permitido\",\"\")","v":""},null,null,null,null,null,null,null,null,null,null,null,null,null,"PV",null,null,null,null,null,null,null,null,"Sim",null,null,null,null,null,null,null,null,null,null,null,null,null,null,null,null,null,null,null,null,null,null,null,null,null,null,null,null,null,null,null,null,null,null,null,null,null,null,null,null,null,null,null,null,null,null,null,null,null,null,null,null,null,null,null,null,null,null,null,null,null,null,null,null,null,null,null,null,null,null,null,null,null,null,null,null,null,null,null,null,null,null,null,null,null,null,null,null,null,null,null,null,null,null,null,null,null,null,null,null,null,null,null,null,null,null,null,null,null,null,null,null,null,null,null,null,null,null,null,null,null,null,null,null,null,null,null,null,null,null,null,null,null,null,null,null,null,null,null,null,null,null,null,null,null,null,null,null,null,null,null,null,null,null,null,null,null,null,null,null,null,null,null,null,null,null,null,null,null,null,null,null,null,null,null,null,null,null,null,null,null,null,null,null,null,null,null,null,null,null,null,{"$f":"Apoio!B34","v":"Valor Financiado"},{"$f":"Apoio!C34","v":0},{"$f":"Apoio!D34","v":117750},{"$f":"Apoio!E34","v":8},null,null,null,null,null,null,null,null,null,null,null,null,null,null,null,null,null,null,null,null,null,null,null,null,null,{"$f":"IO95+60","v":360},5,5,1932]
[null,null,null,null,null,null,null,null,null,null,{"$f":"IF(K3=0,L97,L98)","v":"PRÓ-SOLUTO"},"PRÓ-SOLUTO","TOTAL   ",null,null,{"$f":"SUM(P65,P67,P69,P76,P78,P80,P82,P84,P86,P90,P92,P94,P95,P88)","v":160531},null,null,{"$f":"(AC59-AF97)/AC59","v":1.270213241812485E-4},{"$f":"IF(S97<-0.00005%,\"VALOR PROPOSTO EXCEDIDO\",IF(S97>0.00005%,\"AUMENTAR PROPOSTA\",\"PRÉ-APROVADO\"))","v":"AUMENTAR PROPOSTA"},null,null,null,null,null,{"$f":"SUM(P78,P80,P82,P84,P86,P88,P76,P69,P67)","v":17670},null,"Não",null,null,null,{"$f":"SUM(AF65,AF67,AF69,AF76,AF78,AF80,AF82,AF84,AF86,AF90,AF92,AF95,AF88)","v":157259.37430325744},null,null,null,null,null,null,null,null,null,null,null,null,null,null,null,null,null,null,null,null,null,null,null,null,null,null,null,null,null,null,null,null,null,null,null,null,null,null,null,null,null,null,null,null,null,null,null,null,null,null,null,null,null,null,null,null,null,null,null,null,null,null,null,null,null,null,null,null,null,null,null,null,null,null,null,null,null,null,null,null,null,null,null,null,null,null,null,null,null,null,null,null,null,null,null,null,null,null,null,null,null,null,null,null,null,null,null,null,null,null,null,null,null,null,null,null,null,null,null,null,null,null,null,null,null,null,null,null,null,null,null,null,null,null,null,null,null,null,null,null,null,null,null,null,null,null,null,null,null,null,null,null,null,null,null,null,null,null,null,null,null,null,null,null,null,null,null,null,null,null,null,null,null,null,null,null,null,null,null,null,null,null,null,null,null,null,null,{"$f":"Apoio!B35","v":"Período"},{"$f":"Apoio!C35","v":"Obra"},{"$f":"Apoio!D35","v":"Desembolso"},{"$f":"Apoio!E35","v":"Juros Cliente"},null,null,null,null,null,null,null,null,null,null,null,null,null,null,null,null,null,null,null,null,null,null,null,null,null,null,6,6,1933]
[null,null,null,null,{"$f":"IF(P90>V6*12.5%,\"Pró-Soluto acima do permitido\",\"\")","v":""},null,null,null,null,null,null,{"$f":"Z97/P97","v":0.11007219789324181},null,null,null,null,null,null,{"$f":"IF(SUM(P94:R95)>P57,\"Financiamento superior ao permitido na tabela\",\"ok\")","v":"ok"},null,null,null,null,null,null,null,null,null,null,null,null,null,null,null,null,null,null,null,null,null,null,null,null,null,null,null,null,null,null,null,null,null,null,null,null,null,null,null,null,null,null,null,null,null,null,null,null,null,null,null,null,null,null,null,null,null,null,null,null,null,null,null,null,null,null,null,null,null,null,null,null,null,null,null,null,null,null,null,null,null,null,null,null,null,null,null,null,null,null,null,null,null,null,null,null,null,null,null,null,null,null,null,null,null,null,null,null,null,null,null,null,null,null,null,null,null,null,null,null,null,null,null,null,null,null,null,null,null,null,null,null,null,null,null,null,null,null,null,null,null,null,null,null,null,null,null,null,null,null,null,null,null,null,null,null,null,null,null,null,null,null,null,null,null,null,null,null,null,null,null,null,null,null,null,null,null,null,null,null,null,null,null,null,null,null,null,null,null,null,null,null,null,null,null,null,null,null,null,null,{"$f":"Apoio!B36","v":0},{"$f":"Apoio!C36","v":0},{"$f":"Apoio!D36","v":0},{"$f":"Apoio!E36","v":0},null,null,null,null,null,null,null,null,null,null,null,null,null,null,null,null,null,null,null,null,null,null,null,null,null,null,7,7,1934]
[null,null,null,null,null,null,null,null,null,null,null,null,null,null,null,null,null,null,null,null,null,null,null,null,null,null,null,null,null,null,null,null,null,null,null,null,null,null,null,null,null,null,null,null,null,null,null,null,null,null,null,null,null,null,null,null,null,null,null,null,null,null,null,null,null,null,null,null,null,null,null,null,null,null,null,null,null,null,null,null,null,null,null,null,null,null,null,null,null,null,null,null,null,null,null,null,null,null,null,null,null,null,null,null,null,null,null,null,null,null,null,null,null,null,null,null,null,null,null,null,null,null,null,null,null,null,null,null,null,null,null,null,null,null,null,null,null,null,null,null,null,null,null,null,null,null,null,null,null,null,null,null,null,null,null,null,null,null,null,null,null,null,null,null,null,null,null,null,null,null,null,null,null,null,null,null,null,null,null,null,null,null,null,null,null,null,null,null,null,null,null,null,null,null,null,null,null,null,null,null,null,null,null,null,null,null,null,null,null,null,null,null,null,null,null,null,null,null,null,{"$f":"Apoio!B37","v":1},{"$f":"Apoio!C37","v":0},{"$f":"Apoio!D37","v":0},{"$f":"Apoio!E37","v":0},null,null,null,null,null,null,null,null,null,null,null,null,null,null,null,null,null,null,null,null,null,null,null,null,null,null,8,8,1935]
[null,"INCONSISTÊNCIAS",null,null,null,null,null,null,null,null,null,null,null,null,null,null,null,null,null,null,null,null,null,null,null,null,null,null,null,null,null,null,null,null,null,null,null,null,null,null,null,null,null,null,null,null,null,null,null,null,null,null,null,null,null,null,null,null,null,null,null,null,null,null,null,null,null,null,null,null,null,null,null,null,null,null,null,null,null,null,null,null,null,null,null,null,null,null,null,null,null,null,null,null,null,null,null,null,null,null,null,null,null,null,null,null,null,null,null,null,null,null,null,null,null,null,null,null,null,null,null,null,null,null,null,null,null,null,null,null,null,null,null,null,null,null,null,null,null,null,null,null,null,null,null,null,null,null,null,null,null,null,null,null,null,null,null,null,null,null,null,null,null,null,null,null,null,null,null,null,null,null,null,null,null,null,null,null,null,null,null,null,null,null,null,null,null,null,null,null,null,null,null,null,null,null,null,null,null,null,null,null,null,null,null,null,null,null,null,null,null,null,null,null,null,null,null,null,null,null,null,null,null,null,null,null,null,null,null,null,null,null,null,null,null,null,null,null,null,null,null,null,null,null,null,null,null,null,null,9,9,1936]
[null,null,null,null,null,null,null,null,null,null,null,null,null,null,null,null,null,null,null,null,null,null,null,null,null,null,null,null,null,null,null,null,null,null,null,null,null,null,null,null,null,null,null,null,null,null,null,null,null,null,null,null,null,null,null,null,null,null,null,null,null,null,null,null,null,null,null,null,null,null,null,null,null,null,null,null,null,null,null,null,null,null,null,null,null,null,null,null,null,null,null,null,null,null,null,null,null,null,null,null,null,null,null,null,null,null,null,null,null,null,null,null,null,null,null,null,null,null,null,null,null,null,null,null,null,null,null,null,null,null,null,null,null,null,null,null,null,null,null,null,null,null,null,null,null,null,null,null,null,null,null,null,null,null,null,null,null,null,null,null,null,null,null,null,null,null,null,null,null,null,null,null,null,null,null,null,null,null,null,null,null,null,null,null,null,null,null,null,null,null,null,null,null,null,null,null,null,null,null,null,null,null,null,null,null,null,null,null,null,null,null,null,null,null,null,null,null,null,null,null,null,null,null,null,null,null,null,null,null,null,null,null,null,null,null,null,null,null,null,null,null,null,null,null,null,null,null,null,null,10,10,1937]
[null,null,null,null,null,{"$f":"IF(G80<G82,\"Inconsistência a Mensal 1 não pode ser MENOR que a Mensal 2\",\"OK\")","v":"OK"},null,null,null,null,null,null,null,null,null,null,null,null,null,null,null,null,null,null,null,null,null,null,null,null,null,null,null,null,null,null,null,null,null,null,null,null,null,null,null,null,null,null,null,null,null,null,null,null,null,null,null,null,null,null,null,null,null,null,null,null,null,null,null,null,null,null,null,null,null,null,null,null,null,null,null,null,null,null,null,null,null,null,null,null,null,null,null,null,null,null,null,null,null,null,null,null,null,null,null,null,null,null,null,null,null,null,null,null,null,null,null,null,null,null,null,null,null,null,null,null,null,null,null,null,null,null,null,null,null,null,null,null,null,null,null,null,null,null,null,null,null,null,null,null,null,null,null,null,null,null,null,null,null,null,null,null,null,null,null,null,null,null,null,null,null,null,null,null,null,null,null,null,null,null,null,null,null,null,null,null,null,null,null,null,null,null,null,null,null,null,null,null,null,null,null,null,null,null,null,null,null,null,null,null,null,null,null,null,null,null,null,null,null,{"$f":"Apoio!B38","v":2},{"$f":"Apoio!C38","v":0},{"$f":"Apoio!D38","v":0},{"$f":"Apoio!E38","v":0},null,null,null,null,null,null,null,null,null,null,null,null,null,null,null,null,null,null,null,null,null,null,null,null,null,null,11,11,1938]
[null,null,null,null,null,null,null,null,null,null,null,null,null,null,null,null,null,null,null,null,null,null,null,null,null,null,null,null,null,null,null,null,null,null,null,null,null,null,null,null,null,null,null,null,null,null,null,null,null,null,null,null,null,null,null,null,null,null,null,null,null,null,null,null,null,null,null,null,null,null,null,null,null,null,null,null,null,null,null,null,null,null,null,null,null,null,null,null,null,null,null,null,null,null,null,null,null,null,null,null,null,null,null,null,null,null,null,null,null,null,null,null,null,null,null,null,null,null,null,null,null,null,null,null,null,null,null,null,null,null,null,null,null,null,null,null,null,null,null,null,null,null,null,null,null,null,null,null,null,null,null,null,null,null,null,null,null,null,null,null,null,null,null,null,null,null,null,null,null,null,null,null,null,null,null,null,null,null,null,null,null,null,null,null,null,null,null,null,null,null,null,null,null,null,null,null,null,null,null,null,null,null,null,null,null,null,null,null,null,null,null,null,null,null,null,null,null,null,null,{"$f":"Apoio!B39","v":3},{"$f":"Apoio!C39","v":0},{"$f":"Apoio!D39","v":0},{"$f":"Apoio!E39","v":0},null,null,null,null,null,null,null,null,null,null,null,null,null,null,null,null,null,null,null,null,null,null,null,null,null,null,12,12,1939]
[null,null,null,null,null,null,null,null,null,null,null,null,null,null,null,null,null,null,null,null,null,null,null,null,null,null,null,null,null,null,null,null,null,null,null,null,null,null,null,null,null,null,null,null,null,null,null,null,null,null,null,null,null,null,null,null,null,null,null,null,null,null,null,null,null,null,null,null,null,null,null,null,null,null,null,null,null,null,null,null,null,null,null,null,null,null,null,null,null,null,null,null,null,null,null,null,null,null,null,null,null,null,null,null,null,null,null,null,null,null,null,null,null,null,null,null,null,null,null,null,null,null,null,null,null,null,null,null,null,null,null,null,null,null,null,null,null,null,null,null,null,null,null,null,null,null,null,null,null,null,null,null,null,null,null,null,null,null,null,null,null,null,null,null,null,null,null,null,null,null,null,null,null,null,null,null,null,null,null,null,null,null,null,null,null,null,null,null,null,null,null,null,null,null,null,null,null,null,null,null,null,null,null,null,null,null,null,null,null,null,null,null,null,null,null,null,null,null,null,{"$f":"Apoio!B40","v":4},{"$f":"Apoio!C40","v":0},{"$f":"Apoio!D40","v":0},{"$f":"Apoio!E40","v":0},null,null,null,null,null,null,null,null,null,null,null,null,null,null,null,null,null,null,null,null,null,null,null,null,null,null,13,null,1940]
[null,null,null,null,null,null,null,null,null,null,null,null,null,null,null,null,null,null,null,null,null,null,null,null,null,null,null,null,null,null,null,null,null,null,null,null,null,null,null,null,null,null,null,null,null,null,null,null,null,null,null,null,null,null,null,null,null,null,null,null,null,null,null,null,null,null,null,null,null,null,null,null,null,null,null,null,null,null,null,null,null,null,null,null,null,null,null,null,null,null,null,null,null,null,null,null,null,null,null,null,null,null,null,null,null,null,null,null,null,null,null,null,null,null,null,null,null,null,null,null,null,null,null,null,null,null,null,null,null,null,null,null,null,null,null,null,null,null,null,null,null,null,null,null,null,null,null,null,null,null,null,null,null,null,null,null,null,null,null,null,null,null,null,null,null,null,null,null,null,null,null,null,null,null,null,null,null,null,null,null,null,null,null,null,null,null,null,null,null,null,null,null,null,null,null,null,null,null,null,null,null,null,null,null,null,null,null,null,null,null,null,null,null,null,null,null,null,null,null,{"$f":"Apoio!B41","v":5},{"$f":"Apoio!C41","v":0},{"$f":"Apoio!D41","v":0},{"$f":"Apoio!E41","v":0},null,null,null,null,null,null,null,null,null,null,null,null,null,null,null,null,null,null,null,null,null,null,null,null,null,null,14,null,1941]
[null,null,null,null,null,null,null,null,null,null,null,null,null,null,null,null,null,null,null,null,null,null,null,null,null,null,null,null,null,null,null,null,null,null,null,null,null,null,null,null,null,null,null,null,null,null,null,null,null,null,null,null,null,null,null,null,null,null,null,null,null,null,null,null,null,null,null,null,null,null,null,null,null,null,null,null,null,null,null,null,null,null,null,null,null,null,null,null,null,null,null,null,null,null,null,null,null,null,null,null,null,null,null,null,null,null,null,null,null,null,null,null,null,null,null,null,null,null,null,null,null,null,null,null,null,null,null,null,null,null,null,null,null,null,null,null,null,null,null,null,null,null,null,null,null,null,null,null,null,null,null,null,null,null,null,null,null,null,null,null,null,null,null,null,null,null,null,null,null,null,null,null,null,null,null,null,null,null,null,null,null,null,null,null,null,null,null,null,null,null,null,null,null,null,null,null,null,null,null,null,null,null,null,null,null,null,null,null,null,null,null,null,null,null,null,null,null,null,null,{"$f":"Apoio!B42","v":6},{"$f":"Apoio!C42","v":0},{"$f":"Apoio!D42","v":0},{"$f":"Apoio!E42","v":0},null,null,null,null,null,null,null,null,null,null,null,null,null,null,null,null,null,null,null,null,null,null,null,null,null,null,15,null,1942]
[null,null,null,null,null,null,null,null,null,null,null,null,null,null,null,null,null,null,null,null,null,null,null,null,null,null,null,null,null,null,null,null,null,null,null,null,null,null,null,null,null,null,null,null,null,null,null,null,null,null,null,null,null,null,null,null,null,null,null,null,null,null,null,null,null,null,null,null,null,null,null,null,null,null,null,null,null,null,null,null,null,null,null,null,null,null,null,null,null,null,null,null,null,null,null,null,null,null,null,null,null,null,null,null,null,null,null,null,null,null,null,null,null,null,null,null,null,null,null,null,null,null,null,null,null,null,null,null,null,null,null,null,null,null,null,null,null,null,null,null,null,null,null,null,null,null,null,null,null,null,null,null,null,null,null,null,null,null,null,null,null,null,null,null,null,null,null,null,null,null,null,null,null,null,null,null,null,null,null,null,null,null,null,null,null,null,null,null,null,null,null,null,null,null,null,null,null,null,null,null,null,null,null,null,null,null,null,null,null,null,null,null,null,null,null,null,null,null,null,{"$f":"Apoio!B43","v":7},{"$f":"Apoio!C43","v":0},{"$f":"Apoio!D43","v":0},{"$f":"Apoio!E43","v":0},null,null,null,null,null,null,null,null,null,null,null,null,null,null,null,null,null,null,null,null,null,null,null,null,null,null,16,null,1943]
[null,null,null,null,null,null,null,null,null,null,null,null,null,null,null,null,null,null,null,null,null,null,null,null,null,null,null,null,null,null,null,null,null,null,null,null,null,null,null,null,null,null,null,null,null,null,null,null,null,null,null,null,null,null,null,null,null,null,null,null,null,null,null,null,null,null,null,null,null,null,null,null,null,null,null,null,null,null,null,null,null,null,null,null,null,null,null,null,null,null,null,null,null,null,null,null,null,null,null,null,null,null,null,null,null,null,null,null,null,null,null,null,null,null,null,null,null,null,null,null,null,null,null,null,null,null,null,null,null,null,null,null,null,null,null,null,null,null,null,null,null,null,null,null,null,null,null,null,null,null,null,null,null,null,null,null,null,null,null,null,null,null,null,null,null,null,null,null,null,null,null,null,null,null,null,null,null,null,null,null,null,null,null,null,null,null,null,null,null,null,null,null,null,null,null,null,null,null,null,null,null,null,null,null,null,null,null,null,null,null,null,null,null,null,null,null,null,null,null,{"$f":"Apoio!B44","v":8},{"$f":"Apoio!C44","v":0},{"$f":"Apoio!D44","v":0},{"$f":"Apoio!E44","v":0},null,null,null,null,null,null,null,null,null,null,null,null,null,null,null,null,null,null,null,null,null,null,null,null,null,null,17,null,1944]
[null,null,null,null,null,null,null,null,null,null,null,null,null,null,null,null,null,null,null,null,null,null,null,null,null,null,null,null,null,null,null,null,null,null,null,null,null,null,null,null,null,null,null,null,null,null,null,null,null,null,null,null,null,null,null,null,null,null,null,null,null,null,null,null,null,null,null,null,null,null,null,null,null,null,null,null,null,null,null,null,null,null,null,null,null,null,null,null,null,null,null,null,null,null,null,null,null,null,null,null,null,null,null,null,null,null,null,null,null,null,null,null,null,null,null,null,null,null,null,null,null,null,null,null,null,null,null,null,null,null,null,null,null,null,null,null,null,null,null,null,null,null,null,null,null,null,null,null,null,null,null,null,null,null,null,null,null,null,null,null,null,null,null,null,null,null,null,null,null,null,null,null,null,null,null,null,null,null,null,null,null,null,null,null,null,null,null,null,null,null,null,null,null,null,null,null,null,null,null,null,null,null,null,null,null,null,null,null,null,null,null,null,null,null,null,null,null,null,null,{"$f":"Apoio!B45","v":9},{"$f":"Apoio!C45","v":0},{"$f":"Apoio!D45","v":0},{"$f":"Apoio!E45","v":0},null,null,null,null,null,null,null,null,null,null,null,null,null,null,null,null,null,null,null,null,null,null,null,null,null,null,18,null,1945]
[null,"3. FINANCIAMENTO CAIXA",null,null,null,null,null,null,null,null,null,null,null,null,null,null,null,null,null,null,null,null,null,null,null,null,null,null,null,null,null,"3. ANÁLISE DE CRÉDITO",null,null,null,null,null,null,null,null,null,null,null,null,null,null,null,null,null,null,null,null,null,null,null,null,null,null,null,null,null,null,null,null,null,null,null,null,null,null,null,null,null,null,null,null,null,null,null,null,null,null,null,null,null,null,null,null,null,null,null,null,null,null,null,null,null,null,null,null,null,null,null,null,null,null,null,null,null,null,null,null,null,null,null,null,null,null,null,null,null,null,null,null,null,null,null,null,null,null,null,null,null,null,null,null,null,null,null,null,null,null,null,null,null,null,null,null,null,null,null,null,null,null,null,null,null,null,null,null,null,null,null,null,null,null,null,null,null,null,null,null,null,null,null,null,null,null,null,null,null,null,null,null,null,null,null,null,null,null,null,null,null,null,null,null,null,null,null,null,null,null,null,null,null,null,null,null,null,null,null,null,null,null,null,null,null,null,null,{"$f":"Apoio!B46","v":10},{"$f":"Apoio!C46","v":0},{"$f":"Apoio!D46","v":0},{"$f":"Apoio!E46","v":0},null,null,null,null,null,null,null,null,null,null,null,null,null,null,null,null,null,null,null,null,null,null,null,null,null,null,19,null,1946]
[null,null,null,null,null,null,null,null,null,null,null,null,null,null,null,null,null,null,null,null,null,null,null,null,null,null,null,null,null,null,null,null,null,null,null,null,null,null,null,null,null,null,null,null,null,null,null,null,null,null,null,null,null,null,null,null,null,null,null,null,null,null,null,null,null,null,null,null,null,null,null,null,null,null,null,null,null,null,null,null,null,null,null,null,null,null,null,null,null,null,null,null,null,null,null,null,null,null,null,null,null,null,null,null,null,null,null,null,null,null,null,null,null,null,null,null,null,null,null,null,null,null,null,null,null,null,null,null,null,null,null,null,null,null,null,null,null,null,null,null,null,null,null,null,null,null,null,null,null,null,null,null,null,null,null,null,null,null,null,null,null,null,null,null,null,null,null,null,null,null,null,null,null,null,null,null,null,null,null,null,null,null,null,null,null,null,null,null,null,null,null,null,null,null,null,null,null,null,null,null,null,null,null,null,null,null,null,null,null,null,null,null,null,null,null,null,null,null,null,{"$f":"Apoio!B47","v":11},{"$f":"Apoio!C47","v":0},{"$f":"Apoio!D47","v":0},{"$f":"Apoio!E47","v":0},null,null,null,null,null,null,null,null,null,null,null,null,null,null,null,null,null,null,null,null,null,null,null,null,null,null,20,null,1947]
[null,null,null,null,null,null,null,null,null,null,null,null,null,null,null,null,null,null,null,null,null,null,null,null,null,null,null,null,null,null,null,null,null,null,null,null,null,null,null,null,null,null,null,null,null,null,null,null,null,null,null,null,null,null,null,null,null,null,null,null,null,null,null,null,null,null,null,null,null,null,null,null,null,null,null,null,null,null,null,null,null,null,null,null,null,null,null,null,null,null,null,null,null,null,null,null,null,null,null,null,null,null,null,null,null,null,null,null,null,null,null,null,null,null,null,null,null,null,null,null,null,null,null,null,null,null,null,null,null,null,null,null,null,null,null,null,null,null,null,null,null,null,null,null,null,null,null,null,null,null,null,null,null,null,null,null,null,null,null,null,null,null,null,null,null,null,null,null,null,null,null,null,null,null,null,null,null,null,null,null,null,null,null,null,null,null,null,null,null,null,null,null,null,null,null,null,null,null,null,null,null,null,null,null,null,null,null,null,null,null,null,null,null,null,null,null,null,null,null,{"$f":"Apoio!B48","v":12},{"$f":"Apoio!C48","v":0},{"$f":"Apoio!D48","v":0},{"$f":"Apoio!E48","v":0},null,null,null,null,null,null,null,null,null,null,null,null,null,null,null,null,null,null,null,null,null,null,null,null,null,null,21,null,1948]
[null,null,null,null,null,null,null,null,null,null,null,null,null,null,null,null,null,null,null,null,null,null,null,null,null,null,null,null,null,null,null,null,null,null,null,null,null,null,null,null,null,null,null,null,null,null,null,null,null,null,null,null,null,null,null,null,null,null,null,null,null,null,null,null,null,null,null,null,null,null,null,null,null,null,null,null,null,null,null,null,null,null,null,null,null,null,null,null,null,null,null,null,null,null,null,null,null,null,null,null,null,null,null,null,null,null,null,null,null,null,null,null,null,null,null,null,null,null,null,null,null,null,null,null,null,null,null,null,null,null,null,null,null,null,null,null,null,null,null,null,null,null,null,null,null,null,null,null,null,null,null,null,null,null,null,null,null,null,null,null,null,null,null,null,null,null,null,null,null,null,null,null,null,null,null,null,null,null,null,null,null,null,null,null,null,null,null,null,null,null,null,null,null,null,null,null,null,null,null,null,null,null,null,null,null,null,null,null,null,null,null,null,null,null,null,null,null,null,null,{"$f":"Apoio!B49","v":13},{"$f":"Apoio!C49","v":0},{"$f":"Apoio!D49","v":0},{"$f":"Apoio!E49","v":0},null,null,null,null,null,null,null,null,null,null,null,null,null,null,null,null,null,null,null,null,null,null,null,null,null,null,22,null,1949]
[null,null,"Valor a ser repassado para CAIXA",null,null,"Valor do contrato de financiamento com a CAIXA",null,null,null,"Primeira Parcela do Financiamento",null,null,null,"Última Parcela do\nFinanciamento",null,null,null,null,"Prazo Pós Obra",null,null,null,null,null,null,null,null,null,null,null,null,null,"Renda para \nAnálise (90%)",null,null,"Parcela \nMáxima",null,null,null,"Prazo para o \ntérmino da Obra",null,null,null,"Parcela Média",null,null,null,null,"Resultado",null,null,null,null,null,null,null,null,null,null,null,null,null,null,null,null,null,null,null,null,null,null,null,null,null,null,null,null,null,null,null,null,null,null,null,null,null,null,null,null,null,null,null,null,null,null,null,null,null,null,null,null,null,null,null,null,null,null,null,null,null,null,null,null,null,null,null,null,null,null,null,null,null,null,null,null,null,null,null,null,null,null,null,null,null,null,null,null,null,null,null,null,null,null,null,null,null,null,null,null,null,null,null,null,null,null,null,null,null,null,null,null,null,null,null,null,null,null,null,null,null,null,null,null,null,null,null,null,null,null,null,null,null,null,null,null,null,null,null,null,null,null,null,null,null,null,null,null,null,null,null,null,null,null,null,null,null,null,null,null,null,null,null,null,null,null,null,null,null,null,null,null,null,null,null,null,null,null,null,null,null,null,null,null,null,null,null,null,null,null,null,null,null,null,null,null,null,null,null,null,23,null,1950]
[null,null,null,null,null,null,null,null,null,null,null,null,null,null,null,null,null,null,null,null,null,null,null,null,null,null,null,null,null,null,null,null,null,null,null,null,null,null,null,null,null,null,null,null,null,null,null,null,null,null,null,null,null,null,null,null,null,null,null,null,null,null,null,null,null,null,null,null,null,null,null,null,null,null,null,null,null,null,null,null,null,null,null,null,null,null,null,null,null,null,null,null,null,null,null,null,null,null,null,null,null,null,null,null,null,null,null,null,null,null,null,null,null,null,null,null,null,null,null,null,null,null,null,null,null,null,null,null,null,null,null,null,null,null,null,null,null,null,null,null,null,null,null,null,null,null,null,null,null,null,null,null,null,null,null,null,null,null,null,null,null,null,null,null,null,null,null,null,null,null,null,null,null,null,null,null,null,null,null,null,null,null,null,null,null,null,null,null,null,null,null,null,null,null,null,null,null,null,null,null,null,null,null,null,null,null,null,null,null,null,null,null,null,null,null,null,null,null,null,{"$f":"Apoio!B50","v":14},{"$f":"Apoio!C50","v":0},{"$f":"Apoio!D50","v":0},{"$f":"Apoio!E50","v":0},null,null,null,null,null,null,null,null,null,null,null,null,null,null,null,null,null,null,null,null,null,null,null,null,null,null,24,null,1951]
[null,null,null,null,null,null,null,null,null,null,null,null,null,null,null,null,null,null,null,null,null,null,null,null,null,null,null,null,null,null,null,null,null,null,null,null,null,null,null,null,null,null,null,null,null,null,null,null,null,null,null,null,null,null,null,null,null,null,null,null,null,null,null,null,null,null,null,null,null,null,null,null,null,null,null,null,null,null,null,null,null,null,null,null,null,null,null,null,null,null,null,null,null,null,null,null,null,null,null,null,null,null,null,null,null,null,null,null,null,null,null,null,null,null,null,null,null,null,null,null,null,null,null,null,null,null,null,null,null,null,null,null,null,null,null,null,null,null,null,null,null,null,null,null,null,null,null,null,null,null,null,null,null,null,null,null,null,null,null,null,null,null,null,null,null,null,null,null,null,null,null,null,null,null,null,null,null,null,null,null,null,null,null,null,null,null,null,null,null,null,null,null,null,null,null,null,null,null,null,null,null,null,null,null,null,null,null,null,null,null,null,null,null,null,null,null,null,null,null,{"$f":"Apoio!B51","v":15},{"$f":"Apoio!C51","v":0},{"$f":"Apoio!D51","v":0},{"$f":"Apoio!E51","v":0},null,null,null,null,null,null,null,null,null,null,null,null,null,null,null,null,null,null,null,null,null,null,null,null,null,null,25,null,1952]
[null,null,null,null,null,null,null,null,null,null,null,null,null,null,null,null,null,null,null,null,null,null,null,null,null,null,null,null,null,null,null,null,null,null,null,null,null,null,null,null,null,null,null,null,null,null,null,null,null,null,null,null,null,null,"Parcela Média Com Juros CAIXA",null,null,"Modelo Correto de análise de Crédito",null,null,"Parcela Máxima",null,null,null,null,null,null,null,null,null,null,null,null,null,null,null,null,null,null,null,null,null,null,null,null,null,null,null,null,null,null,null,null,null,null,null,null,null,null,null,null,null,null,null,null,null,null,null,null,null,null,null,null,null,null,null,null,null,null,null,null,null,null,null,null,null,null,null,null,null,null,null,null,null,null,null,null,null,null,null,null,null,null,null,null,null,null,null,null,null,null,null,null,null,null,null,null,null,null,null,null,null,null,null,null,null,null,null,null,null,null,null,null,null,null,null,null,null,null,null,null,null,null,null,null,null,null,null,null,null,null,null,null,null,null,null,null,null,null,null,null,null,null,null,null,null,null,null,null,null,null,null,null,null,null,null,null,null,null,{"$f":"Apoio!B52","v":16},{"$f":"Apoio!C52","v":0},{"$f":"Apoio!D52","v":0},{"$f":"Apoio!E52","v":0},null,null,null,null,null,null,null,null,null,null,null,null,null,null,null,null,null,null,null,null,null,null,null,null,null,null,26,null,1953]
[null,null,null,null,null,null,null,null,null,null,null,null,null,null,null,null,null,null,null,null,null,null,null,null,null,null,null,null,null,null,null,null,null,null,null,null,null,null,null,null,null,null,null,null,null,null,null,null,null,null,null,null,null,null,null,null,null,null,null,null,null,null,null,null,null,null,null,null,null,null,null,null,null,null,null,null,null,null,null,null,null,null,null,null,null,null,null,null,null,null,null,null,null,null,null,null,null,null,null,null,null,null,null,null,null,null,null,null,null,null,null,null,null,null,null,null,null,null,null,null,null,null,null,null,null,null,null,null,null,null,null,null,null,null,null,null,null,null,null,null,null,null,null,null,null,null,null,null,null,null,null,null,null,null,null,null,null,null,null,null,null,null,null,null,null,null,null,null,null,null,null,null,null,null,null,null,null,null,null,null,null,null,null,null,null,null,null,null,null,null,null,null,null,null,null,null,null,null,null,null,null,null,null,null,null,null,null,null,null,null,null,null,null,null,null,null,null,null,null,{"$f":"Apoio!B53","v":17},{"$f":"Apoio!C53","v":0},{"$f":"Apoio!D53","v":0},{"$f":"Apoio!E53","v":0},null,null,null,null,null,null,null,null,null,null,null,null,null,null,null,null,null,null,null,null,null,null,null,null,null,null,27,null,1954]
[null,null,{"$f":"SUM(P94:R95)","v":139761},null,null,{"$f":"P95","v":117750},null,null,null,{"$f":"IF(Z20=1,(F119/G28)+(F119*(F24/12))+'Premissas e Calculos'!R32,-PMT(($F$24/12),$G$28,$F$119,0,0)+'Premissas e Calculos'!$R$32)","v":645.26546109679373},null,null,null,{"$f":"IF(Z20=1,F119/G28+'Premissas e Calculos'!R32,J119)","v":645.26546109679373},null,null,null,null,{"$f":"G28","v":360},null,null,null,null,null,null,null,null,null,null,null,null,null,{"$f":"F20*90%","v":1935},null,null,{"$f":"'Premissas e Calculos'!M19","v":580.5},null,null,null,{"$f":"Apoio!I35","v":31},null,null,null,{"$f":"(MAXA(IF(#REF!=\"Mensal\",#REF!,0),IF(#REF!=\"Mensal\",#REF!,0),IF(D88=\"Mensal\",G88,0),IF(D90=\"mensal\",G90,0))+(SUMIF(D80:D90,\"anual\",G80:G92)/12 +SUMIF(D80:D90,\"semestral\",G80:G92)/6+P92/(AN119+3)))","v":{"$error":"#REF!"}},null,null,null,null,{"$f":"IF(AR119>AJ119,\"Não Aprovado\",\"Crédito Pré-Aprovado\")","v":{"$error":"#REF!"}},null,null,null,null,null,null,null,null,null,null,null,null,null,null,null,null,null,null,null,null,null,null,null,null,null,null,null,null,null,null,null,null,null,null,null,null,null,null,null,null,null,null,null,null,null,null,null,null,null,null,null,null,null,null,null,null,null,null,null,null,null,null,null,null,null,null,null,null,null,null,null,null,null,null,null,null,null,null,null,null,null,null,null,null,null,null,null,null,null,null,null,null,null,null,null,null,null,null,null,null,null,null,null,null,null,null,null,null,null,null,null,null,null,null,null,null,null,null,null,null,null,null,null,null,null,null,null,null,null,null,null,null,null,null,null,null,null,null,null,null,null,null,null,null,null,null,null,null,null,null,null,null,null,null,null,null,null,null,null,null,null,null,null,null,null,null,null,null,null,null,{"$f":"Apoio!B54","v":18},{"$f":"Apoio!C54","v":0},{"$f":"Apoio!D54","v":0},{"$f":"Apoio!E54","v":0},null,null,null,null,null,null,null,null,null,null,null,null,null,null,null,null,null,null,null,null,null,null,null,null,null,null,28,null,1955]
[null,null,null,null,null,null,null,null,null,null,null,null,null,null,null,null,null,null,null,null,null,null,null,null,null,null,null,null,null,null,null,null,null,null,null,null,null,null,null,null,null,null,null,null,null,null,null,null,null,null,null,null,null,null,{"$f":"AR119+SUM(Apoio!E37:E76)/'Simulador CEF'!AN119","v":{"$error":"#REF!"}},null,null,{"$f":"IF(BC120>BI120,\"Parcela superior ao permitido. Aumentar a entrada ou o valor financiado.\",\"Crédito Aprovado!\")","v":{"$error":"#REF!"}},null,null,{"$f":"'Premissas e Calculos'!M17","v":632.10505684045472},null,null,null,null,null,null,null,null,null,null,null,null,null,null,null,null,null,null,null,null,null,null,null,null,null,null,null,null,null,null,null,null,null,null,null,null,null,null,null,null,null,null,null,null,null,null,null,null,null,null,null,null,null,null,null,null,null,null,null,null,null,null,null,null,null,null,null,null,null,null,null,null,null,null,null,null,null,null,null,null,null,null,null,null,null,null,null,null,null,null,null,null,null,null,null,null,null,null,null,null,null,null,null,null,null,null,null,null,null,null,null,null,null,null,null,null,null,null,null,null,null,null,null,null,null,null,null,null,null,null,null,null,null,null,null,null,null,null,null,null,null,null,null,null,null,null,null,null,null,null,null,null,null,null,null,null,null,null,{"$f":"Apoio!B55","v":19},{"$f":"Apoio!C55","v":0},{"$f":"Apoio!D55","v":0},{"$f":"Apoio!E55","v":0},null,null,null,null,null,null,null,null,null,null,null,null,null,null,null,null,null,null,null,null,null,null,null,null,null,null,29,null,1956]
[null,null,null,null,null,null,null,null,null,null,null,null,null,null,null,null,null,null,null,null,null,null,null,null,null,null,null,null,null,null,null,null,null,null,null,null,null,null,null,null,null,null,null,null,null,null,null,null,null,null,null,null,null,null,null,null,null,null,null,null,null,null,null,null,null,null,null,null,null,null,null,null,null,null,null,null,null,null,null,null,null,null,null,null,null,null,null,null,null,null,null,null,null,null,null,null,null,null,null,null,null,null,null,null,null,null,null,null,null,null,null,null,null,null,null,null,null,null,null,null,null,null,null,null,null,null,null,null,null,null,null,null,null,null,null,null,null,null,null,null,null,null,null,null,null,null,null,null,null,null,null,null,null,null,null,null,null,null,null,null,null,null,null,null,null,null,null,null,null,null,null,null,null,null,null,null,null,null,null,null,null,null,null,null,null,null,null,null,null,null,null,null,null,null,null,null,null,null,null,null,null,null,null,null,null,null,null,null,null,null,null,null,null,null,null,null,null,null,null,{"$f":"Apoio!B56","v":20},{"$f":"Apoio!C56","v":0},{"$f":"Apoio!D56","v":0},{"$f":"Apoio!E56","v":0},null,null,null,null,null,null,null,null,null,null,null,null,null,null,null,null,null,null,null,null,null,null,null,null,null,null,30,null,1957]
[null,null,null,null,null,null,null,null,null,null,null,null,null,null,null,null,null,null,null,null,null,null,null,null,null,null,null,null,null,null,null,null,null,null,null,null,null,null,null,null,null,null,null,null,null,null,null,null,null,null,null,null,null,null,null,null,null,null,null,null,null,null,null,null,null,null,null,null,null,null,null,null,null,null,null,null,null,null,null,null,null,null,null,null,null,null,null,null,null,null,null,null,null,null,null,null,null,null,null,null,null,null,null,null,null,null,null,null,null,null,null,null,null,null,null,null,null,null,null,null,null,null,null,null,null,null,null,null,null,null,null,null,null,null,null,null,null,null,null,null,null,null,null,null,null,null,null,null,null,null,null,null,null,null,null,null,null,null,null,null,null,null,null,null,null,null,null,null,null,null,null,null,null,null,null,null,null,null,null,null,null,null,null,null,null,null,null,null,null,null,null,null,null,null,null,null,null,null,null,null,null,null,null,null,null,null,null,null,null,null,null,null,null,null,null,null,null,null,null,{"$f":"Apoio!B57","v":21},{"$f":"Apoio!C57","v":0},{"$f":"Apoio!D57","v":0},{"$f":"Apoio!E57","v":0},null,null,null,null,null,null,null,null,null,null,null,null,null,null,null,null,null,null,null,null,null,null,null,null,null,null,31,null,1958]
[null,null,null,null,null,null,null,null,null,null,null,null,null,null,null,null,null,null,null,null,null,null,null,null,null,null,null,null,null,null,null,null,null,null,null,null,null,null,null,null,null,null,null,null,null,null,null,null,null,null,null,null,null,null,null,null,null,null,null,null,null,null,null,null,null,null,null,null,null,null,null,null,null,null,null,null,null,null,null,null,null,null,null,null,null,null,null,null,null,null,null,null,null,null,null,null,null,null,null,null,null,null,null,null,null,null,null,null,null,null,null,null,null,null,null,null,null,null,null,null,null,null,null,null,null,null,null,null,null,null,null,null,null,null,null,null,null,null,null,null,null,null,null,null,null,null,null,null,null,null,null,null,null,null,null,null,null,null,null,null,null,null,null,null,null,null,null,null,null,null,null,null,null,null,null,null,null,null,null,null,null,null,null,null,null,null,null,null,null,null,null,null,null,null,null,null,null,null,null,null,null,null,null,null,null,null,null,null,null,null,null,null,null,null,null,null,null,null,null,{"$f":"Apoio!B58","v":22},{"$f":"Apoio!C58","v":0},{"$f":"Apoio!D58","v":0},{"$f":"Apoio!E58","v":0},null,null,null,null,null,null,null,null,null,null,null,null,null,null,null,null,null,null,null,null,null,null,null,null,null,null,null,null,1959]
[null,null,null,null,null,null,null,null,null,null,null,null,null,null,null,null,null,null,null,null,null,null,null,null,null,null,null,null,null,null,null,null,null,null,null,null,null,null,null,null,null,null,null,null,null,null,null,null,null,null,null,null,null,null,null,null,null,null,null,null,null,null,null,null,null,null,null,null,null,null,null,null,null,null,null,null,null,null,null,null,null,null,null,null,null,null,null,null,null,null,null,null,null,null,null,null,null,null,null,null,null,null,null,null,null,null,null,null,null,null,null,null,null,null,null,null,null,null,null,null,null,null,null,null,null,null,null,null,null,null,null,null,null,null,null,null,null,null,null,null,null,null,null,null,null,null,null,null,null,null,null,null,null,null,null,null,null,null,null,null,null,null,null,null,null,null,null,null,null,null,null,null,null,null,null,null,null,null,null,null,null,null,null,null,null,null,null,null,null,null,null,null,null,null,null,null,null,null,null,null,null,null,null,null,null,null,null,null,null,null,null,null,null,null,null,null,null,null,null,{"$f":"Apoio!B59","v":23},{"$f":"Apoio!C59","v":0},{"$f":"Apoio!D59","v":0},{"$f":"Apoio!E59","v":0},null,null,null,null,null,null,null,null,null,null,null,null,null,null,null,null,null,null,null,null,null,null,null,null,null,null,null,null,1960]
[null,"4. PREVISÃO DE ENCARGOS  - DURANTE A OBRA",null,null,null,null,null,null,null,null,null,null,null,null,null,null,null,null,null,null,null,null,null,null,null,null,null,null,null,null,null,null,null,null,null,null,null,null,null,null,null,null,null,null,null,null,null,null,null,null,null,null,null,null,null,null,null,null,null,null,null,null,null,null,null,null,null,null,null,null,null,null,null,null,null,null,null,null,null,null,null,null,null,null,null,null,null,null,null,null,null,null,null,null,null,null,null,null,null,null,null,null,null,null,null,null,null,null,null,null,null,null,null,null,null,null,null,null,null,null,null,null,null,null,null,null,null,null,null,null,null,null,null,null,null,null,null,null,null,null,null,null,null,null,null,null,null,null,null,null,null,null,null,null,null,null,null,null,null,null,null,null,null,null,null,null,null,null,null,null,null,null,null,null,null,null,null,null,null,null,null,null,null,null,null,null,null,null,null,null,null,null,null,null,null,null,null,null,null,null,null,null,null,null,null,null,null,null,null,null,null,null,null,null,null,null,null,null,null,{"$f":"Apoio!B60","v":24},{"$f":"Apoio!C60","v":0},{"$f":"Apoio!D60","v":0},{"$f":"Apoio!E60","v":0},null,null,null,null,null,null,null,null,null,null,null,null,null,null,null,null,null,null,null,null,null,null,null,null,null,null,null,null,1961]
[null,null,null,null,null,null,null,null,null,null,null,null,null,null,null,null,null,null,null,null,null,null,null,null,null,null,null,null,null,null,null,null,null,null,null,null,null,null,null,null,null,null,null,null,null,null,null,null,null,null,null,null,null,null,null,null,null,null,null,null,null,null,null,null,null,null,null,null,null,null,null,null,null,null,null,null,null,null,null,null,null,null,null,null,null,null,null,null,null,null,null,null,null,null,null,null,null,null,null,null,null,null,null,null,null,null,null,null,null,null,null,null,null,null,null,null,null,null,null,null,null,null,null,null,null,null,null,null,null,null,null,null,null,null,null,null,null,null,null,null,null,null,null,null,null,null,null,null,null,null,null,null,null,null,null,null,null,null,null,null,null,null,null,null,null,null,null,null,null,null,null,null,null,null,null,null,null,null,null,null,null,null,null,null,null,null,null,null,null,null,null,null,null,null,null,null,null,null,null,null,null,null,null,null,null,null,null,null,null,null,null,null,null,null,null,null,null,null,null,{"$f":"Apoio!B61","v":25},{"$f":"Apoio!C61","v":0},{"$f":"Apoio!D61","v":0},{"$f":"Apoio!E61","v":0},null,null,null,null,null,null,null,null,null,null,null,null,null,null,null,null,null,null,null,null,null,null,null,null,null,null,null,null,1962]
[null,null,null,null,null,null,null,null,null,null,null,null,null,null,null,null,null,null,null,null,null,null,null,null,null,null,null,null,null,null,null,null,null,null,null,null,null,null,null,null,null,null,null,null,null,null,null,null,null,null,null,null,null,null,null,null,null,null,null,null,null,null,null,null,null,null,null,null,null,null,null,null,null,null,null,null,null,null,null,null,null,null,null,null,null,null,null,null,null,null,null,null,null,null,null,null,null,null,null,null,null,null,null,null,null,null,null,null,null,null,null,null,null,null,null,null,null,null,null,null,null,null,null,null,null,null,null,null,null,null,null,null,null,null,null,null,null,null,null,null,null,null,null,null,null,null,null,null,null,null,null,null,null,null,null,null,null,null,null,null,null,null,null,null,null,null,null,null,null,null,null,null,null,null,null,null,null,null,null,null,null,null,null,null,null,null,null,null,null,null,null,null,null,null,null,null,null,null,null,null,null,null,null,null,null,null,null,null,null,null,null,null,null,null,null,null,null,null,null,{"$f":"Apoio!B62","v":26},{"$f":"Apoio!C62","v":0},{"$f":"Apoio!D62","v":0},{"$f":"Apoio!E62","v":0},null,null,null,null,null,null,null,null,null,null,null,null,null,null,null,null,null,null,null,null,null,null,null,null,null,null,null,null,1963]
[null,null,null,null,null,null,null,null,null,null,null,null,null,null,null,null,null,null,null,null,null,null,null,null,null,null,null,null,null,null,null,null,null,null,null,null,null,null,null,null,null,null,null,null,null,null,null,null,null,null,null,null,null,null,null,null,null,null,null,null,null,null,null,null,null,null,null,null,null,null,null,null,null,null,null,null,null,null,null,null,null,null,null,null,null,null,null,null,null,null,null,null,null,null,null,null,null,null,null,null,null,null,null,null,null,null,null,null,null,null,null,null,null,null,null,null,null,null,null,null,null,null,null,null,null,null,null,null,null,null,null,null,null,null,null,null,null,null,null,null,null,null,null,null,null,null,null,null,null,null,null,null,null,null,null,null,null,null,null,null,null,null,null,null,null,null,null,null,null,null,null,null,null,null,null,null,null,null,null,null,null,null,null,null,null,null,null,null,null,null,null,null,null,null,null,null,null,null,null,null,null,null,null,null,null,null,null,null,null,null,null,null,null,null,null,null,null,null,null,null,null,null,null,null,null,null,null,null,null,null,null,null,null,null,null,null,null,null,null,null,null,null,null,null,null,null,null,null,null,null,null,1964]
[null,null,null,null,null,null,null,null,null,null,null,null,null,null,null,null,null,null,null,null,null,null,null,null,null,null,null,null,null,null,null,null,"Parcela Média de Encargos CAIXA",null,null,null,null,"Parcela Média Total (CAIXA + Incorporador)",null,null,null,null,"Maior Parcela Mensal (CAIXA + Incorporador)",null,null,null,null,null,null,null,null,null,null,null,null,null,null,null,null,null,null,null,null,null,null,null,null,null,null,null,null,null,null,null,null,null,null,null,null,null,null,null,null,null,null,null,null,null,null,null,null,null,null,null,null,null,null,null,null,null,null,null,null,null,null,null,null,null,null,null,null,null,null,null,null,null,null,null,null,null,null,null,null,null,null,null,null,null,null,null,null,null,null,null,null,null,null,null,null,null,null,null,null,null,null,null,null,null,null,null,null,null,null,null,null,null,null,null,null,null,null,null,null,null,null,null,null,null,null,null,null,null,null,null,null,null,null,null,null,null,null,null,null,null,null,null,null,null,null,null,null,null,null,null,null,null,null,null,null,null,null,null,null,null,null,null,null,null,null,null,null,null,null,null,null,null,null,null,null,{"$f":"Apoio!B63","v":27},{"$f":"Apoio!C63","v":0},{"$f":"Apoio!D63","v":0},{"$f":"Apoio!E63","v":0},null,null,null,null,null,null,null,null,null,null,null,null,null,null,null,null,null,null,null,null,null,null,null,null,null,null,null,null,1965]
[null,null,null,null,null,"Primeira Parcela de\n Encargos CAIXA",null,null,null,null,null,"Última Parcela de  Encargos CAIXA",null,null,null,null,null,null,null,null,null,null,null,null,null,null,null,null,null,null,null,null,null,null,null,null,null,null,null,null,null,null,null,null,null,null,null,null,null,null,null,null,null,null,null,null,null,null,null,null,null,null,null,null,null,null,null,null,null,null,null,null,null,null,null,null,null,null,null,null,null,null,null,null,null,null,null,null,null,null,null,null,null,null,null,null,null,null,null,null,null,null,null,null,null,null,null,null,null,null,null,null,null,null,null,null,null,null,null,null,null,null,null,null,null,null,null,null,null,null,null,null,null,null,null,null,null,null,null,null,null,null,null,null,null,null,null,null,null,null,null,null,null,null,null,null,null,null,null,null,null,null,null,null,null,null,null,null,null,null,null,null,null,null,null,null,null,null,null,null,null,null,null,null,null,null,null,null,null,null,null,null,null,null,null,null,null,null,null,null,null,null,null,null,null,null,null,null,null,null,null,null,null,null,null,null,null,null,null,{"$f":"Apoio!B64","v":28},{"$f":"Apoio!C64","v":0},{"$f":"Apoio!D64","v":0},{"$f":"Apoio!E64","v":0},null,null,null,null,null,null,null,null,null,null,null,null,null,null,null,null,null,null,null,null,null,null,null,null,null,null,null,null,1966]
[null,null,null,null,null,null,null,null,null,null,null,null,null,null,null,null,null,null,null,null,null,null,null,null,null,null,null,null,null,null,null,null,null,null,null,null,null,null,null,null,null,null,null,null,null,null,null,null,null,null,null,null,null,null,null,null,null,null,null,null,null,null,null,null,null,null,null,null,null,null,null,null,null,null,null,null,null,null,null,null,null,null,null,null,null,null,null,null,null,null,null,null,null,null,null,null,null,null,null,null,null,null,null,null,null,null,null,null,null,null,null,null,null,null,null,null,null,null,null,null,null,null,null,null,null,null,null,null,null,null,null,null,null,null,null,null,null,null,null,null,null,null,null,null,null,null,null,null,null,null,null,null,null,null,null,null,null,null,null,null,null,null,null,null,null,null,null,null,null,null,null,null,null,null,null,null,null,null,null,null,null,null,null,null,null,null,null,null,null,null,null,null,null,null,null,null,null,null,null,null,null,null,null,null,null,null,null,null,null,null,null,null,null,null,null,null,null,null,null,{"$f":"Apoio!B65","v":29},{"$f":"Apoio!C65","v":0},{"$f":"Apoio!D65","v":0},{"$f":"Apoio!E65","v":0},null,null,null,null,null,null,null,null,null,null,null,null,null,null,null,null,null,null,null,null,null,null,null,null,null,null,null,null,1967]
[null,null,null,null,null,null,null,null,null,null,null,null,null,null,null,null,null,null,null,null,null,null,null,null,null,null,null,null,null,null,null,null,{"$f":"SUM(J158:L197)/(Apoio!F35-AN149)","v":0},null,null,null,null,{"$f":"SUM(S158:T197)/(AN119-E65)","v":133.33333333333334},null,null,null,null,{"$f":"LARGE(S158:T197,1)","v":2000},null,null,null,null,null,null,null,null,null,null,null,null,null,null,null,null,null,null,null,null,null,null,null,null,null,null,null,null,null,null,null,null,null,null,null,null,null,null,null,null,null,null,null,null,null,null,null,null,null,null,null,null,null,null,null,null,null,null,null,null,null,null,null,null,null,null,null,null,null,null,null,null,null,null,null,null,null,null,null,null,null,null,null,null,null,null,null,null,null,null,null,null,null,null,null,null,null,null,null,null,null,null,null,null,null,null,null,null,null,null,null,null,null,null,null,null,null,null,null,null,null,null,null,null,null,null,null,null,null,null,null,null,null,null,null,null,null,null,null,null,null,null,null,null,null,null,null,null,null,null,null,null,null,null,null,null,null,null,null,null,null,null,null,null,null,null,null,null,null,null,null,null,null,null,null,null,{"$f":"Apoio!B66","v":30},{"$f":"Apoio!C66","v":0},{"$f":"Apoio!D66","v":0},{"$f":"Apoio!E66","v":0},null,null,null,null,null,null,null,null,null,null,null,null,null,null,null,null,null,null,null,null,null,null,null,null,null,null,null,null,1968]
[null,null,null,null,null,{"$f":"L133*20%","v":93.21875},null,null,null,null,null,{"$f":"F119*0.95*(F24/12)","v":466.09375},null,null,null,null,null,null,null,null,null,null,null,null,null,null,null,null,null,null,null,null,null,null,null,null,null,null,null,null,null,null,null,null,null,null,null,null,null,null,null,null,null,null,null,null,null,null,null,null,null,null,null,null,null,null,null,null,null,null,null,null,null,null,null,null,null,null,null,null,null,null,null,null,null,null,null,null,null,null,null,null,null,null,null,null,null,null,null,null,null,null,null,null,null,null,null,null,null,null,null,null,null,null,null,null,null,null,null,null,null,null,null,null,null,null,null,null,null,null,null,null,null,null,null,null,null,null,null,null,null,null,null,null,null,null,null,null,null,null,null,null,null,null,null,null,null,null,null,null,null,null,null,null,null,null,null,null,null,null,null,null,null,null,null,null,null,null,null,null,null,null,null,null,null,null,null,null,null,null,null,null,null,null,null,null,null,null,null,null,null,null,null,null,null,null,null,null,null,null,null,null,null,null,null,null,null,null,null,{"$f":"Apoio!B67","v":31},{"$f":"Apoio!C67","v":0},{"$f":"Apoio!D67","v":0},{"$f":"Apoio!E67","v":0},null,null,null,null,null,null,null,null,null,null,null,null,null,null,null,null,null,null,null,null,null,null,null,null,null,null,null,null,1969]
[null,null,null,null,null,null,null,null,null,null,null,null,null,null,null,null,null,null,null,null,null,null,null,null,null,null,null,null,null,null,null,null,null,null,null,null,null,null,null,null,null,null,null,null,null,null,null,null,null,null,null,null,null,null,null,null,null,null,null,null,null,null,null,null,null,null,null,null,null,null,null,null,null,null,null,null,null,null,null,null,null,null,null,null,null,null,null,null,null,null,null,null,null,null,null,null,null,null,null,null,null,null,null,null,null,null,null,null,null,null,null,null,null,null,null,null,null,null,null,null,null,null,null,null,null,null,null,null,null,null,null,null,null,null,null,null,null,null,null,null,null,null,null,null,null,null,null,null,null,null,null,null,null,null,null,null,null,null,null,null,null,null,null,null,null,null,null,null,null,null,null,null,null,null,null,null,null,null,null,null,null,null,null,null,null,null,null,null,null,null,null,null,null,null,null,null,null,null,null,null,null,null,null,null,null,null,null,null,null,null,null,null,null,null,null,null,null,null,null,{"$f":"Apoio!B68","v":32},{"$f":"Apoio!C68","v":0},{"$f":"Apoio!D68","v":0},{"$f":"Apoio!E68","v":0},null,null,null,null,null,null,null,null,null,null,null,null,null,null,null,null,null,null,null,null,null,null,null,null,null,null,null,null,1970]
[null,null,null,null,null,null,null,null,null,null,null,null,null,null,null,null,null,null,null,null,null,null,null,null,null,null,null,null,null,null,null,null,null,null,null,null,null,null,null,null,null,null,null,null,null,null,null,null,null,null,null,null,null,null,null,null,null,null,null,null,null,null,null,null,null,null,null,null,null,null,null,null,null,null,null,null,null,null,null,null,null,null,null,null,null,null,null,null,null,null,null,null,null,null,null,null,null,null,null,null,null,null,null,null,null,null,null,null,null,null,null,null,null,null,null,null,null,null,null,null,null,null,null,null,null,null,null,null,null,null,null,null,null,null,null,null,null,null,null,null,null,null,null,null,null,null,null,null,null,null,null,null,null,null,null,null,null,null,null,null,null,null,null,null,null,null,null,null,null,null,null,null,null,null,null,null,null,null,null,null,null,null,null,null,null,null,null,null,null,null,null,null,null,null,null,null,null,null,null,null,null,null,null,null,null,null,null,null,null,null,null,null,null,null,null,null,null,null,null,{"$f":"Apoio!B69","v":33},{"$f":"Apoio!C69","v":0},{"$f":"Apoio!D69","v":0},{"$f":"Apoio!E69","v":0},null,null,null,null,null,null,null,null,null,null,null,null,null,null,null,null,null,null,null,null,null,null,null,null,null,null,null,null,1971]
[null,null,null,null,null,null,null,null,null,null,null,null,null,null,null,null,null,null,null,null,null,null,null,null,null,null,null,null,null,null,null,null,null,null,null,null,null,null,null,null,null,null,null,null,null,null,null,null,null,null,null,null,null,null,null,null,null,null,null,null,null,null,null,null,null,null,null,null,null,null,null,null,null,null,null,null,null,null,null,null,null,null,null,null,null,null,null,null,null,null,null,null,null,null,null,null,null,null,null,null,null,null,null,null,null,null,null,null,null,null,null,null,null,null,null,null,null,null,null,null,null,null,null,null,null,null,null,null,null,null,null,null,null,null,null,null,null,null,null,null,null,null,null,null,null,null,null,null,null,null,null,null,null,null,null,null,null,null,null,null,null,null,null,null,null,null,null,null,null,null,null,null,null,null,null,null,null,null,null,null,null,null,null,null,null,null,null,null,null,null,null,null,null,null,null,null,null,null,null,null,null,null,null,null,null,null,null,null,null,null,null,null,null,null,null,null,null,null,null,null,null,null,null,null,null,null,null,null,null,null,null,null,null,null,null,null,null,null,null,null,null,null,null,null,null,null,null,null,null,null,null,1972]
[null,null,null,null,null,null,null,null,null,null,null,null,null,null,null,null,null,null,null,null,null,null,null,null,null,null,null,null,null,null,null,null,null,null,null,null,null,null,null,null,null,null,null,null,null,null,null,null,null,null,null,null,null,null,null,null,null,null,null,null,null,null,null,null,null,null,null,null,null,null,null,null,null,null,null,null,null,null,null,null,null,null,null,null,null,null,null,null,null,null,null,null,null,null,null,null,null,null,null,null,null,null,null,null,null,null,null,null,null,null,null,null,null,null,null,null,null,null,null,null,null,null,null,null,null,null,null,null,null,null,null,null,null,null,null,null,null,null,null,null,null,null,null,null,null,null,null,null,null,null,null,null,null,null,null,null,null,null,null,null,null,null,null,null,null,null,null,null,null,null,null,null,null,null,null,null,null,null,null,null,null,null,null,null,null,null,null,null,null,null,null,null,null,null,null,null,null,null,null,null,null,null,null,null,null,null,null,null,null,null,null,null,null,null,null,null,null,null,null,{"$f":"Apoio!B70","v":34},{"$f":"Apoio!C70","v":0},{"$f":"Apoio!D70","v":0},{"$f":"Apoio!E70","v":0},null,null,null,null,null,null,null,null,null,null,null,null,null,null,null,null,null,null,null,null,null,null,null,null,null,null,null,null,1973]
[null,null,null,null,null,null,null,null,null,null,null,null,null,null,null,null,null,null,null,null,null,null,null,null,null,null,null,null,null,null,null,null,null,null,null,null,null,null,null,null,null,null,null,null,null,null,null,null,null,null,null,null,null,null,null,null,null,null,null,null,null,null,null,null,null,null,null,null,null,null,null,null,null,null,null,null,null,null,null,null,null,null,null,null,null,null,null,null,null,null,null,null,null,null,null,null,null,null,null,null,null,null,null,null,null,null,null,null,null,null,null,null,null,null,null,null,null,null,null,null,null,null,null,null,null,null,null,null,null,null,null,null,null,null,null,null,null,null,null,null,null,null,null,null,null,null,null,null,null,null,null,null,null,null,null,null,null,null,null,null,null,null,null,null,null,null,null,null,null,null,null,null,null,null,null,null,null,null,null,null,null,null,null,null,null,null,null,null,null,null,null,null,null,null,null,null,null,null,null,null,null,null,null,null,null,null,null,null,null,null,null,null,null,null,null,null,null,null,null,{"$f":"Apoio!B71","v":35},{"$f":"Apoio!C71","v":0},{"$f":"Apoio!D71","v":0},{"$f":"Apoio!E71","v":0},null,null,null,null,null,null,null,null,null,null,null,null,null,null,null,null,null,null,null,null,null,null,null,null,null,null,null,null,1974]
[null,null,null,null,null,null,null,null,null,null,null,null,null,null,null,null,null,null,null,null,null,null,null,null,null,null,null,null,null,null,null,null,null,null,null,null,null,null,null,null,null,null,null,null,null,null,null,null,null,null,null,null,null,null,null,null,null,null,null,null,null,null,null,null,null,null,null,null,null,null,null,null,null,null,null,null,null,null,null,null,null,null,null,null,null,null,null,null,null,null,null,null,null,null,null,null,null,null,null,null,null,null,null,null,null,null,null,null,null,null,null,null,null,null,null,null,null,null,null,null,null,null,null,null,null,null,null,null,null,null,null,null,null,null,null,null,null,null,null,null,null,null,null,null,null,null,null,null,null,null,null,null,null,null,null,null,null,null,null,null,null,null,null,null,null,null,null,null,null,null,null,null,null,null,null,null,null,null,null,null,null,null,null,null,null,null,null,null,null,null,null,null,null,null,null,null,null,null,null,null,null,null,null,null,null,null,null,null,null,null,null,null,null,null,null,null,null,null,null,{"$f":"Apoio!B72","v":36},{"$f":"Apoio!C72","v":0},{"$f":"Apoio!D72","v":0},{"$f":"Apoio!E72","v":0},null,null,null,null,null,null,null,null,null,null,null,null,null,null,null,null,null,null,null,null,null,null,null,null,null,null,null,null,1975]
[null,null,null,null,null,null,null,null,null,null,null,null,null,null,null,null,null,null,null,null,null,null,null,null,null,null,null,null,null,null,null,null,null,null,null,null,null,null,null,null,null,null,null,null,null,null,null,null,null,null,null,null,null,null,null,null,null,null,null,null,null,null,null,null,null,null,null,null,null,null,null,null,null,null,null,null,null,null,null,null,null,null,null,null,null,null,null,null,null,null,null,null,null,null,null,null,null,null,null,null,null,null,null,null,null,null,null,null,null,null,null,null,null,null,null,null,null,null,null,null,null,null,null,null,null,null,null,null,null,null,null,null,null,null,null,null,null,null,null,null,null,null,null,null,null,null,null,null,null,null,null,null,null,null,null,null,null,null,null,null,null,null,null,null,null,null,null,null,null,null,null,null,null,null,null,null,null,null,null,null,null,null,null,null,null,null,null,null,null,null,null,null,null,null,null,null,null,null,null,null,null,null,null,null,null,null,null,null,null,null,null,null,null,null,null,null,null,null,null,{"$f":"Apoio!B73","v":37},{"$f":"Apoio!C73","v":0},{"$f":"Apoio!D73","v":0},{"$f":"Apoio!E73","v":0},null,null,null,null,null,null,null,null,null,null,null,null,null,null,null,null,null,null,null,null,null,null,null,null,null,null,null,null,1976]
[null,null,null,null,null,null,null,null,null,null,null,null,null,null,null,null,null,null,null,null,null,null,null,null,null,null,null,null,null,null,null,null,null,null,null,null,null,null,null,null,null,null,null,null,null,null,null,null,null,null,null,null,null,null,null,null,null,null,null,null,null,null,null,null,null,null,null,null,null,null,null,null,null,null,null,null,null,null,null,null,null,null,null,null,null,null,null,null,null,null,null,null,null,null,null,null,null,null,null,null,null,null,null,null,null,null,null,null,null,null,null,null,null,null,null,null,null,null,null,null,null,null,null,null,null,null,null,null,null,null,null,null,null,null,null,null,null,null,null,null,null,null,null,null,null,null,null,null,null,null,null,null,null,null,null,null,null,null,null,null,null,null,null,null,null,null,null,null,null,null,null,null,null,null,null,null,null,null,null,null,null,null,null,null,null,null,null,null,null,null,null,null,null,null,null,null,null,null,null,null,null,null,null,null,null,null,null,null,null,null,null,null,null,null,null,null,null,null,null,{"$f":"Apoio!B74","v":38},{"$f":"Apoio!C74","v":0},{"$f":"Apoio!D74","v":0},{"$f":"Apoio!E74","v":0},null,null,null,null,null,null,null,null,null,null,null,null,null,null,null,null,null,null,null,null,null,null,null,null,null,null,null,null,1977]
[null,null,null,null,null,null,null,null,null,null,null,null,null,null,null,null,null,null,null,null,null,null,null,null,null,null,null,null,null,null,null,null,null,null,null,null,null,null,null,null,null,null,null,null,null,null,null,null,null,null,null,null,null,null,null,null,null,null,null,null,null,null,null,null,null,null,null,null,null,null,null,null,null,null,null,null,null,null,null,null,null,null,null,null,null,null,null,null,null,null,null,null,null,null,null,null,null,null,null,null,null,null,null,null,null,null,null,null,null,null,null,null,null,null,null,null,null,null,null,null,null,null,null,null,null,null,null,null,null,null,null,null,null,null,null,null,null,null,null,null,null,null,null,null,null,null,null,null,null,null,null,null,null,null,null,null,null,null,null,null,null,null,null,null,null,null,null,null,null,null,null,null,null,null,null,null,null,null,null,null,null,null,null,null,null,null,null,null,null,null,null,null,null,null,null,null,null,null,null,null,null,null,null,null,null,null,null,null,null,null,null,null,null,null,null,null,null,null,null,{"$f":"Apoio!B75","v":39},{"$f":"Apoio!C75","v":0},{"$f":"Apoio!D75","v":0},{"$f":"Apoio!E75","v":0},null,null,null,null,null,null,null,null,null,null,null,null,null,null,null,null,null,null,null,null,null,null,null,null,null,null,null,null,1978]
[null,null,"Qualquer  fluxo ou valor diferente do proposto pela tabela de vendas só será válido com autorização da Sec. Vendas",null,null,null,null,null,null,null,null,null,null,null,null,null,null,null,null,null,null,null,null,null,null,null,null,null,null,null,null,null,null,null,null,null,null,null,null,null,null,null,null,null,null,null,null,null,null,null,null,null,null,null,null,null,null,null,null,null,null,null,null,null,null,null,null,null,null,null,null,null,null,null,null,null,null,null,null,null,null,null,null,null,null,null,null,null,null,null,null,null,null,null,null,null,null,null,null,null,null,null,null,null,null,null,null,null,null,null,null,null,null,null,null,null,null,null,null,null,null,null,null,null,null,null,null,null,null,null,null,null,null,null,null,null,null,null,null,null,null,null,null,null,null,null,null,null,null,null,null,null,null,null,null,null,null,null,null,null,null,null,null,null,null,null,null,null,null,null,null,null,null,null,null,null,null,null,null,null,null,null,null,null,null,null,null,null,null,null,null,null,null,null,null,null,null,null,null,null,null,null,null,null,null,null,null,null,null,null,null,null,null,null,null,null,null,null,null,{"$f":"Apoio!B76","v":40},{"$f":"Apoio!C76","v":0},{"$f":"Apoio!D76","v":0},{"$f":"Apoio!E76","v":0},null,null,null,null,null,null,null,null,null,null,null,null,null,null,null,null,null,null,null,null,null,null,null,null,null,null,null,null,1979]
[null,null,null,null,null,null,null,null,null,null,null,null,null,null,null,null,null,null,null,null,null,null,null,null,null,null,null,null,null,null,null,null,null,null,null,null,null,null,null,null,null,null,null,null,null,null,null,null,null,null,null,null,null,null,null,null,null,null,null,null,null,null,null,null,null,null,null,null,null,null,null,null,null,null,null,null,null,null,null,null,null,null,null,null,null,null,null,null,null,null,null,null,null,null,null,null,null,null,null,null,null,null,null,null,null,null,null,null,null,null,null,null,null,null,null,null,null,null,null,null,null,null,null,null,null,null,null,null,null,null,null,null,null,null,null,null,null,null,null,null,null,null,null,null,null,null,null,null,null,null,null,null,null,null,null,null,null,null,null,null,null,null,null,null,null,null,null,null,null,null,null,null,null,null,null,null,null,null,null,null,null,null,null,null,null,null,null,null,null,null,null,null,null,null,null,null,null,null,null,null,null,null,null,null,null,null,null,null,null,null,null,null,null,null,null,null,null,null,null,null,null,null,null,null,null,null,null,null,null,null,null,null,null,null,null,null,null,null,null,null,null,null,null,null,null,null,null,null,null,null,null,1980]
[null,null,null,null,null,null,null,null,null,null,null,null,null,null,null,null,null,null,null,null,null,null,null,null,null,null,null,null,null,null,null,null,null,null,null,null,null,null,null,null,null,null,null,null,null,null,null,null,null,null,null,null,null,null,null,null,null,null,null,null,null,null,null,null,null,null,null,null,null,null,null,null,null,null,null,null,null,null,null,null,null,null,null,null,null,null,null,null,null,null,null,null,null,null,null,null,null,null,null,null,null,null,null,null,null,null,null,null,null,null,null,null,null,null,null,null,null,null,null,null,null,null,null,null,null,null,null,null,null,null,null,null,null,null,null,null,null,null,null,null,null,null,null,null,null,null,null,null,null,null,null,null,null,null,null,null,null,null,null,null,null,null,null,null,null,null,null,null,null,null,null,null,null,null,null,null,null,null,null,null,null,null,null,null,null,null,null,null,null,null,null,null,null,null,null,null,null,null,null,null,null,null,null,null,null,null,null,null,null,null,null,null,null,null,null,null,null,null,null,null,null,null,null,null,null,null,null,null,null,null,null,null,null,null,null,null,null,null,null,null,null,null,null,null,null,null,null,null,null,null,null,1981]
[null,null,null,null,null,null,null,null,null,null,null,null,null,null,null,null,null,null,null,null,null,null,null,null,null,null,null,null,null,null,null,null,null,null,null,null,null,null,null,"Mês do Repasse Estimado",null,null,null,null,null,null,null,null,null,null,null,null,null,null,null,null,null,null,null,null,null,null,null,null,null,null,null,null,null,null,null,null,null,null,null,null,null,null,null,null,null,null,null,null,null,null,null,null,null,null,null,null,null,null,null,null,null,null,null,null,null,null,null,null,null,null,null,null,null,null,null,null,null,null,null,null,null,null,null,null,null,null,null,null,null,null,null,null,null,null,null,null,null,null,null,null,null,null,null,null,null,null,null,null,null,null,null,null,null,null,null,null,null,null,null,null,null,null,null,null,null,null,null,null,null,null,null,null,null,null,null,null,null,null,null,null,null,null,null,null,null,null,null,null,null,null,null,null,null,null,null,null,null,null,null,null,null,null,null,null,null,null,null,null,null,null,null,null,null,null,null,null,null,null,null,null,null,null,null,null,null,null,null,null,null,null,null,null,null,null,null,null,null,null,null,null,null,null,null,null,null,null,null,null,null,null,null,null,null,null,null,1982]
[null,null,null,null,null,null,null,null,null,null,null,null,null,null,null,null,null,null,null,null,null,null,null,null,null,null,null,null,null,null,null,null,null,null,null,null,null,null,null,null,null,null,null,null,null,null,null,null,null,null,null,null,null,null,null,null,null,null,null,null,null,null,null,null,null,null,null,null,null,null,null,null,null,null,null,null,null,null,null,null,null,null,null,null,null,null,null,null,null,null,null,null,null,null,null,null,null,null,null,null,null,null,null,null,null,null,null,null,null,null,null,null,null,null,null,null,null,null,null,null,null,null,null,null,null,null,null,null,null,null,null,null,null,null,null,null,null,null,null,null,null,null,null,null,null,null,null,null,null,null,null,null,null,null,null,null,null,null,null,null,null,null,null,null,null,null,null,null,null,null,null,null,null,null,null,null,null,null,null,null,null,null,null,null,null,null,null,null,null,null,null,null,null,null,null,null,null,null,null,null,null,null,null,null,null,null,null,null,null,null,null,null,null,null,null,null,null,null,null,null,null,null,null,null,null,null,null,null,null,null,null,null,null,null,null,null,null,null,null,null,null,null,null,null,null,null,null,null,null,null,null,1983]
[null,null,null,null,null,null,null,null,null,null,null,null,null,null,null,null,null,null,null,null,null,null,null,null,null,null,null,null,null,null,null,null,null,null,null,null,null,null,null,null,null,null,null,null,null,null,null,null,null,null,null,null,null,null,null,null,null,null,null,null,null,null,null,null,null,null,null,null,null,null,null,null,null,null,null,null,null,null,null,null,null,null,null,null,null,null,null,null,null,null,null,null,null,null,null,null,null,null,null,null,null,null,null,null,null,null,null,null,null,null,null,null,null,null,null,null,null,null,null,null,null,null,null,null,null,null,null,null,null,null,null,null,null,null,null,null,null,null,null,null,null,null,null,null,null,null,null,null,null,null,null,null,null,null,null,null,null,null,null,null,null,null,null,null,null,null,null,null,null,null,null,null,null,null,null,null,null,null,null,null,null,null,null,null,null,null,null,null,null,null,null,null,null,null,null,null,null,null,null,null,null,null,null,null,null,null,null,null,null,null,null,null,null,null,null,null,null,null,null,null,null,null,null,null,null,null,null,null,null,null,null,null,null,null,null,null,null,null,null,null,null,null,null,null,null,null,null,null,null,null,null,1984]
[null,null,null,null,null,null,null,null,null,null,null,null,null,null,null,null,null,null,null,null,null,null,null,null,null,null,null,null,null,null,null,null,null,null,null,null,null,null,null,{"$f":"'Premissas e Calculos'!J30","v":3},{"$f":"DATE(YEAR(I12),MONTH(I12)+AN149,DAY(I12))","v":"2021-12-01"},null,null,null,null,null,null,null,null,null,null,null,null,null,null,null,null,null,null,null,null,null,null,null,null,null,null,null,null,null,null,null,null,null,null,null,null,null,null,null,null,null,null,null,null,null,null,null,null,null,null,null,null,null,null,null,null,null,null,null,null,null,null,null,null,null,null,null,null,null,null,null,null,null,null,null,null,null,null,null,null,null,null,null,null,null,null,null,null,null,null,null,null,null,null,null,null,null,null,null,null,null,null,null,null,null,null,null,null,null,null,null,null,null,null,null,null,null,null,null,null,null,null,null,null,null,null,null,null,null,null,null,null,null,null,null,null,null,null,null,null,null,null,null,null,null,null,null,null,null,null,null,null,null,null,null,null,null,null,null,null,null,null,null,null,null,null,null,null,null,null,null,null,null,null,null,null,null,null,null,null,null,null,null,null,null,null,null,null,null,null,null,null,null,null,null,null,null,null,null,null,null,null,null,null,null,null,null,null,null,null,1985]
[null,null,null,null,null,null,null,null,null,null,null,null,null,null,null,null,null,null,null,null,null,null,null,null,null,null,null,null,null,null,null,null,null,null,null,null,null,null,null,null,null,null,null,null,null,null,null,null,null,null,null,null,null,null,null,null,null,null,null,null,null,null,null,null,null,null,null,null,null,null,null,null,null,null,null,null,null,null,null,null,null,null,null,null,null,null,null,null,null,null,null,null,null,null,null,null,null,null,null,null,null,null,null,null,null,null,null,null,null,null,null,null,null,null,null,null,null,null,null,null,null,null,null,null,null,null,null,null,null,null,null,null,null,null,null,null,null,null,null,null,null,null,null,null,null,null,null,null,null,null,null,null,null,null,null,null,null,null,null,null,null,null,null,null,null,null,null,null,null,null,null,null,null,null,null,null,null,null,null,null,null,null,null,null,null,null,null,null,null,null,null,null,null,null,null,null,null,null,null,null,null,null,null,null,null,null,null,null,null,null,null,null,null,null,null,null,null,null,null,null,null,null,null,null,null,null,null,null,null,null,null,null,null,null,null,null,null,null,null,null,null,null,null,null,null,null,null,null,null,null,null,1986]
[null,null,null,null,null,null,null,null,null,null,null,null,null,null,null,null,null,null,null,null,null,null,null,null,null,null,null,null,null,null,null,null,null,null,null,null,null,null,null,null,null,null,null,null,null,null,null,null,null,null,null,null,null,null,null,null,null,null,null,null,null,null,null,null,null,null,null,null,null,null,null,null,null,null,null,null,null,null,null,null,null,null,null,null,null,null,null,null,null,null,null,null,null,null,null,null,null,null,null,null,null,null,null,null,null,null,null,null,null,null,null,null,null,null,null,null,null,null,null,null,null,null,null,null,null,null,null,null,null,null,null,null,null,null,null,null,null,null,null,null,null,null,null,null,null,null,null,null,null,null,null,null,null,null,null,null,null,null,null,null,null,null,null,null,null,null,null,null,null,null,null,null,null,null,null,null,null,null,null,null,null,null,null,null,null,null,null,null,null,null,null,null,null,null,null,null,null,null,null,null,null,null,null,null,null,null,null,null,null,null,null,null,null,null,null,null,null,null,null,null,null,null,null,null,null,null,null,null,null,null,null,null,null,null,null,null,null,null,null,null,null,null,null,null,null,null,null,null,null,null,null,1987]
[null,null,null,null,null,null,null,null,null,null,null,null,null,null,null,null,null,null,null,null,null,null,null,null,null,null,null,null,null,null,null,null,null,null,null,null,null,null,null,null,null,null,null,null,null,null,null,null,null,null,null,null,null,null,null,null,null,null,null,null,null,null,null,null,null,null,null,null,null,null,null,null,null,null,null,null,null,null,null,null,null,null,null,null,null,null,null,null,null,null,null,null,null,null,null,null,null,null,null,null,null,null,null,null,null,null,null,null,null,null,null,null,null,null,null,null,null,null,null,null,null,null,null,null,null,null,null,null,null,null,null,null,null,null,null,null,null,null,null,null,null,null,null,null,null,null,null,null,null,null,null,null,null,null,null,null,null,null,null,null,null,null,null,null,null,null,null,null,null,null,null,null,null,null,null,null,null,null,null,null,null,null,null,null,null,null,null,null,null,null,null,null,null,null,null,null,null,null,null,null,null,null,null,null,null,null,null,null,null,null,null,null,null,null,null,null,null,null,null,null,null,null,null,null,null,null,null,null,null,null,null,null,null,null,null,null,null,null,null,null,null,null,null,null,null,null,null,null,null,null,null,1988]
[null,null,null,null,null,null,null,null,null,null,null,null,null,null,null,null,null,null,null,null,null,null,null,null,null,null,null,null,null,null,null,null,null,null,null,null,null,null,null,null,null,null,null,null,null,null,null,null,null,null,null,null,null,null,null,null,null,null,null,null,null,null,null,null,null,null,null,null,null,null,null,null,null,null,null,null,null,null,null,null,null,null,null,null,null,null,null,null,null,null,null,null,null,null,null,null,null,null,null,null,null,null,null,null,null,null,null,null,null,null,null,null,null,null,null,null,null,null,null,null,null,null,null,null,null,null,null,null,null,null,null,null,null,null,null,null,null,null,null,null,null,null,null,null,null,null,null,null,null,null,null,null,null,null,null,null,null,null,null,null,null,null,null,null,null,null,null,null,null,null,null,null,null,null,null,null,null,null,null,null,null,null,null,null,null,null,null,null,null,null,null,null,null,null,null,null,null,null,null,null,null,null,null,null,null,null,null,null,null,null,null,null,null,null,null,null,null,null,null,null,null,null,null,null,null,null,null,null,null,null,null,null,null,null,null,null,null,null,null,null,null,null,null,null,null,null,null,null,null,null,null,1989]
[null,null,null,null,null,null,null,null,null,null,null,null,null,null,null,null,null,null,null,null,null,null,null,null,null,null,null,null,null,null,null,null,null,null,null,null,null,null,null,null,null,null,null,null,null,null,null,null,null,null,null,null,null,null,null,null,null,null,null,null,null,null,null,null,null,null,null,null,null,null,null,null,null,null,null,null,null,null,null,null,null,null,null,null,null,null,null,null,null,null,null,null,null,null,null,null,null,null,null,null,null,null,null,null,null,null,null,null,null,null,null,null,null,null,null,null,null,null,null,null,null,null,null,null,null,null,null,null,null,null,null,null,null,null,null,null,null,null,null,null,null,null,null,null,null,null,null,null,null,null,null,null,null,null,null,null,null,null,null,null,null,null,null,null,null,null,null,null,null,null,null,null,null,null,null,null,null,null,null,null,null,null,null,null,null,null,null,null,null,null,null,null,null,null,null,null,null,null,null,null,null,null,null,null,null,null,null,null,null,null,null,null,null,null,null,null,null,null,null,null,null,null,null,null,null,null,null,null,null,null,null,null,null,null,null,null,null,null,null,null,null,null,null,null,null,null,null,null,null,null,null,1990]
[null,null,null,null,null,"Mês","Data",null,null,"Encargos \nCAIXA",null,null,"Encargos Incorporador",null,"Total",null,null,null,"somatório de parcelas CAIXA e Incorporador - (Entrada e Chaves)",null,null,null,null,null,null,null,null,"Serie 1","Parcela 1","Serie 2 ","Parcela 2","Serie 3","Parcela 3","Serie 4","Parcela 4","Serie Entrada","Parcela Entrada","Parcela Chaves",null,null,null,null,null,null,null,null,null,null,null,null,null,null,null,null,null,null,null,null,null,null,null,null,null,null,null,null,null,null,null,null,null,null,null,null,null,null,null,null,null,null,null,null,null,null,null,null,null,null,null,null,null,null,null,null,null,null,null,null,null,null,null,null,null,null,null,null,null,null,null,null,null,null,null,null,null,null,null,null,null,null,null,null,null,null,null,null,null,null,null,null,null,null,null,null,null,null,null,null,null,null,null,null,null,null,null,null,null,null,null,null,null,null,null,null,null,null,null,null,null,null,null,null,null,null,null,null,null,null,null,null,null,null,null,null,null,null,null,null,null,null,null,null,null,null,null,null,null,null,null,null,null,null,null,null,null,null,null,null,null,null,null,null,null,null,null,null,null,null,null,null,null,null,null,null,null,null,null,null,null,null,null,null,null,null,null,null,null,null,null,null,null,null,null,null,null,null,null,null,null,null,null,null,null,null,null,null,null,null,null,null,null,1991]
[null,null,null,null,null,null,null,null,null,null,null,null,null,null,null,null,null,null,null,null,null,null,null,null,null,null,null,null,null,null,null,null,null,null,null,null,null,null,null,null,null,null,null,null,null,null,null,null,null,null,null,null,null,null,null,null,null,null,null,null,null,null,null,null,null,null,null,null,null,null,null,null,null,null,null,null,null,null,null,null,null,null,null,null,null,null,null,null,null,null,null,null,null,null,null,null,null,null,null,null,null,null,null,null,null,null,null,null,null,null,null,null,null,null,null,null,null,null,null,null,null,null,null,null,null,null,null,null,null,null,null,null,null,null,null,null,null,null,null,null,null,null,null,null,null,null,null,null,null,null,null,null,null,null,null,null,null,null,null,null,null,null,null,null,null,null,null,null,null,null,null,null,null,null,null,null,null,null,null,null,null,null,null,null,null,null,null,null,null,null,null,null,null,null,null,null,null,null,null,null,null,null,null,null,null,null,null,null,null,null,null,null,null,null,null,null,null,null,null,null,null,null,null,null,null,null,null,null,null,null,null,null,null,null,null,null,null,null,null,null,null,null,null,null,null,null,null,null,null,null,null,1992]
[null,null,null,null,null,null,null,null,null,null,null,null,null,null,null,null,null,null,null,null,null,null,null,null,null,null,null,{"$f":"#REF!","v":{"$error":"#REF!"}},{"$f":"IF(AND(AB157>=#REF!,AB157<(#REF!+#REF!*$A$80)),#REF!,0)","v":{"$error":"#REF!"}},{"$f":"#REF!","v":{"$error":"#REF!"}},{"$f":"IF(AND(AD157>=#REF!,AD157<(#REF!+#REF!*$A$86)),#REF!,0)","v":{"$error":"#REF!"}},{"$f":"K88","v":15},{"$f":"IF(AND(AF157>=$K$88,AF157<($K$88+$E$88*$A$88)),$G$88,0)","v":2000},{"$f":"K90","v":38},{"$f":"IF(AND(AH157>=$K$90,AH157<($K$90+$E$90*$A$90)),$G$90,0)","v":0},1,{"$f":"IF(AND(AJ157>=$K$65,AJ157<($K$65+$E$65*$A$65)),$G$65,0)","v":0},1,{"$f":"IF(AL157=$K$92,$G$92,0)","v":0},null,null,null,null,null,null,null,null,null,null,null,null,null,null,null,null,null,null,null,null,null,null,null,null,null,null,null,null,null,null,null,null,null,null,null,null,null,null,null,null,null,null,null,null,null,null,null,null,null,null,null,null,null,null,null,null,null,null,null,null,null,null,null,null,null,null,null,null,null,null,null,null,null,null,null,null,null,null,null,null,null,null,null,null,null,null,null,null,null,null,null,null,null,null,null,null,null,null,null,null,null,null,null,null,null,null,null,null,null,null,null,null,null,null,null,null,null,null,null,null,null,null,null,null,null,null,null,null,null,null,null,null,null,null,null,null,null,null,null,null,null,null,null,null,null,null,null,null,null,null,null,null,null,null,null,null,null,null,null,null,null,null,null,null,null,null,null,null,null,null,null,null,null,null,null,null,null,null,null,null,null,null,null,null,null,null,null,null,null,null,null,null,null,null,null,null,null,null,null,null,null,null,null,null,null,null,null,null,null,null,null,null,1993]
[null,null,null,null,null,1,{"$f":"I12","v":"2021-09-01"},null,null,{"$f":"IF(F158<=$AN$149,0,Apoio!E37)","v":0},null,null,{"$f":"VLOOKUP(F158,$AD$157:$AE$338,2,FALSE)+VLOOKUP(F158,$AF$157:$AG$371,2,FALSE)+VLOOKUP(F158,$AH$157:$AI$371,2,FALSE)+VLOOKUP(F158,$AJ$157:$AK$371,2,FALSE)+VLOOKUP(F158,$AL$157:$AM$371,2,FALSE)+VLOOKUP(F158,$AB$157:$AC$371,2,FALSE)","v":0},null,{"$f":"M158+J158","v":0},null,null,null,{"$f":"VLOOKUP(F158,$AD$157:$AE$338,2,FALSE)+VLOOKUP(F158,$AF$157:$AG$371,2,FALSE)+VLOOKUP(F158,$AH$157:$AI$371,2,FALSE)+VLOOKUP(F158,$AB$157:$AC$371,2,FALSE)+IF(F158<=$AN$119,J158)","v":0},null,null,null,null,null,null,null,null,{"$f":"AB157+$A$80","v":{"$error":"#REF!"}},{"$f":"IF(AND(AB158>=#REF!,AB158<(#REF!+#REF!*$A$80)),#REF!,0)","v":{"$error":"#REF!"}},{"$f":"AD157+$A$86","v":{"$error":"#REF!"}},{"$f":"IF(AND(AD158>=#REF!,AD158<(#REF!+#REF!*$A$86)),#REF!,0)","v":{"$error":"#REF!"}},{"$f":"AF157+$A$88","v":27},{"$f":"IF(AND(AF158>=$K$88,AF158<($K$88+$E$88*$A$88)),$G$88,0)","v":2000},{"$f":"AH157+$A$90","v":38},{"$f":"IF(AND(AH158>=$K$90,AH158<($K$90+$E$90*$A$90)),$G$90,0)","v":0},2,{"$f":"IF(AND(AJ158>=$K$65,AJ158<($K$65+$E$65*$A$65)),$G$65,0)","v":0},2,0,null,null,null,null,null,null,null,null,null,null,null,null,null,null,null,null,null,null,null,null,null,null,null,null,null,null,null,null,null,null,null,null,null,null,null,null,null,null,null,null,null,null,null,null,null,null,null,null,null,null,null,null,null,null,null,null,null,null,null,null,null,null,null,null,null,null,null,null,null,null,null,null,null,null,null,null,null,null,null,null,null,null,null,null,null,null,null,null,null,null,null,null,null,null,null,null,null,null,null,null,null,null,null,null,null,null,null,null,null,null,null,null,null,null,null,null,null,null,null,null,null,null,null,null,null,null,null,null,null,null,null,null,null,null,null,null,null,null,null,null,null,null,null,null,null,null,null,null,null,null,null,null,null,null,null,null,null,null,null,null,null,null,null,null,null,null,null,null,null,null,null,null,null,null,null,null,null,null,null,null,null,null,null,null,null,null,null,null,null,null,null,null,null,null,null,null,null,null,null,null,null,null,null,null,null,null,null,null,null,null,null,null,1994]
[null,null,null,null,null,2,{"$f":"DATE(YEAR(G158),MONTH(G158)+1,DAY(G158))","v":"2021-10-01"},null,null,{"$f":"IF(F159<=$AN$149,0,Apoio!E38)","v":0},null,null,{"$f":"VLOOKUP(F159,$AD$157:$AE$338,2,FALSE)+VLOOKUP(F159,$AF$157:$AG$371,2,FALSE)+VLOOKUP(F159,$AH$157:$AI$371,2,FALSE)+VLOOKUP(F159,$AJ$157:$AK$371,2,FALSE)+VLOOKUP(F159,$AL$157:$AM$371,2,FALSE)+VLOOKUP(F159,$AB$157:$AC$371,2,FALSE)","v":0},null,{"$f":"M159+J159","v":0},null,null,null,0,null,null,null,null,null,null,null,null,{"$f":"AB158+$A$80","v":{"$error":"#REF!"}},{"$f":"IF(AND(AB159>=#REF!,AB159<(#REF!+#REF!*$A$80)),#REF!,0)","v":{"$error":"#REF!"}},{"$f":"AD158+$A$86","v":{"$error":"#REF!"}},{"$f":"IF(AND(AD159>=#REF!,AD159<(#REF!+#REF!*$A$86)),#REF!,0)","v":{"$error":"#REF!"}},{"$f":"AF158+$A$88","v":39},0,{"$f":"AH158+$A$90","v":38},0,3,0,3,0,null,null,null,null,null,null,null,null,null,null,null,null,null,null,null,null,null,null,null,null,null,null,null,null,null,null,null,null,null,null,null,null,null,null,null,null,null,null,null,null,null,null,null,null,null,null,null,null,null,null,null,null,null,null,null,null,null,null,null,null,null,null,null,null,null,null,null,null,null,null,null,null,null,null,null,null,null,null,null,null,null,null,null,null,null,null,null,null,null,null,null,null,null,null,null,null,null,null,null,null,null,null,null,null,null,null,null,null,null,null,null,null,null,null,null,null,null,null,null,null,null,null,null,null,null,null,null,null,null,null,null,null,null,null,null,null,null,null,null,null,null,null,null,null,null,null,null,null,null,null,null,null,null,null,null,null,null,null,null,null,null,null,null,null,null,null,null,null,null,null,null,null,null,null,null,null,null,null,null,null,null,null,null,null,null,null,null,null,null,null,null,null,null,null,null,null,null,null,null,null,null,null,null,null,null,null,null,null,null,null,null,null,1995]
[null,null,null,null,null,3,{"$f":"DATE(YEAR(G159),MONTH(G159)+1,DAY(G159))","v":"2021-11-01"},null,null,{"$f":"IF(F160<=$AN$149,0,Apoio!E39)","v":0},null,null,{"$f":"VLOOKUP(F160,$AD$157:$AE$338,2,FALSE)+VLOOKUP(F160,$AF$157:$AG$371,2,FALSE)+VLOOKUP(F160,$AH$157:$AI$371,2,FALSE)+VLOOKUP(F160,$AJ$157:$AK$371,2,FALSE)+VLOOKUP(F160,$AL$157:$AM$371,2,FALSE)+VLOOKUP(F160,$AB$157:$AC$371,2,FALSE)","v":0},null,0,null,null,null,0,null,null,null,null,null,null,null,null,{"$error":"#REF!"},{"$f":"IF(AND(AB160>=#REF!,AB160<(#REF!+#REF!*$A$80)),#REF!,0)","v":{"$error":"#REF!"}},{"$error":"#REF!"},{"$f":"IF(AND(AD160>=#REF!,AD160<(#REF!+#REF!*$A$86)),#REF!,0)","v":{"$error":"#REF!"}},51,0,38,0,4,0,4,0,null,null,null,null,null,null,null,null,null,null,null,null,null,null,null,null,null,null,null,null,null,null,null,null,null,null,null,null,null,null,null,null,null,null,null,null,null,null,null,null,null,null,null,null,null,null,null,null,null,null,null,null,null,null,null,null,null,null,null,null,null,null,null,null,null,null,null,null,null,null,null,null,null,null,null,null,null,null,null,null,null,null,null,null,null,null,null,null,null,null,null,null,null,null,null,null,null,null,null,null,null,null,null,null,null,null,null,null,null,null,null,null,null,null,null,null,null,null,null,null,null,null,null,null,null,null,null,null,null,null,null,null,null,null,null,null,null,null,null,null,null,null,null,null,null,null,null,null,null,null,null,null,null,null,null,null,null,null,null,null,null,null,null,null,null,null,null,null,null,null,null,null,null,null,null,null,null,null,null,null,null,null,null,null,null,null,null,null,null,null,null,null,null,null,null,null,null,null,null,null,null,null,null,null,null,null,null,null,null,null,null,null,1996]
[null,null,null,null,null,4,"2021-12-01",null,null,{"$f":"IF(F161<=$AN$149,0,Apoio!E40)","v":0},null,null,0,null,0,null,null,null,0,null,null,null,null,null,null,null,null,{"$error":"#REF!"},{"$f":"IF(AND(AB161>=#REF!,AB161<(#REF!+#REF!*$A$80)),#REF!,0)","v":{"$error":"#REF!"}},{"$error":"#REF!"},{"$f":"IF(AND(AD161>=#REF!,AD161<(#REF!+#REF!*$A$86)),#REF!,0)","v":{"$error":"#REF!"}},63,0,38,0,5,0,5,0,null,null,null,null,null,null,null,null,null,null,null,null,null,null,null,null,null,null,null,null,null,null,null,null,null,null,null,null,null,null,null,null,null,null,null,null,null,null,null,null,null,null,null,null,null,null,null,null,null,null,null,null,null,null,null,null,null,null,null,null,null,null,null,null,null,null,null,null,null,null,null,null,null,null,null,null,null,null,null,null,null,null,null,null,null,null,null,null,null,null,null,null,null,null,null,null,null,null,null,null,null,null,null,null,null,null,null,null,null,null,null,null,null,null,null,null,null,null,null,null,null,null,null,null,null,null,null,null,null,null,null,null,null,null,null,null,null,null,null,null,null,null,null,null,null,null,null,null,null,null,null,null,null,null,null,null,null,null,null,null,null,null,null,null,null,null,null,null,null,null,null,null,null,null,null,null,null,null,null,null,null,null,null,null,null,null,null,null,null,null,null,null,null,null,null,null,null,null,null,null,null,null,null,null,null,null,null,null,null,null,null,null,1997]
[null,null,null,null,null,5,"2022-01-01",null,null,{"$f":"IF(F162<=$AN$149,0,Apoio!E41)","v":0},null,null,0,null,0,null,null,null,0,null,null,null,null,null,null,null,null,{"$error":"#REF!"},{"$f":"IF(AND(AB162>=#REF!,AB162<(#REF!+#REF!*$A$80)),#REF!,0)","v":{"$error":"#REF!"}},{"$error":"#REF!"},{"$f":"IF(AND(AD162>=#REF!,AD162<(#REF!+#REF!*$A$86)),#REF!,0)","v":{"$error":"#REF!"}},75,0,38,0,6,0,6,0,null,null,null,null,null,null,null,null,null,null,null,null,null,null,null,null,null,null,null,null,null,null,null,null,null,null,null,null,null,null,null,null,null,null,null,null,null,null,null,null,null,null,null,null,null,null,null,null,null,null,null,null,null,null,null,null,null,null,null,null,null,null,null,null,null,null,null,null,null,null,null,null,null,null,null,null,null,null,null,null,null,null,null,null,null,null,null,null,null,null,null,null,null,null,null,null,null,null,null,null,null,null,null,null,null,null,null,null,null,null,null,null,null,null,null,null,null,null,null,null,null,null,null,null,null,null,null,null,null,null,null,null,null,null,null,null,null,null,null,null,null,null,null,null,null,null,null,null,null,null,null,null,null,null,null,null,null,null,null,null,null,null,null,null,null,null,null,null,null,null,null,null,null,null,null,null,null,null,null,null,null,null,null,null,null,null,null,null,null,null,null,null,null,null,null,null,null,null,null,null,null,null,null,null,null,null,null,null,null,null,null,null,1998]
[null,null,null,null,null,6,"2022-02-01",null,null,{"$f":"IF(F163<=$AN$149,0,Apoio!E42)","v":0},null,null,0,null,0,null,null,null,0,null,null,null,null,null,null,null,null,{"$error":"#REF!"},{"$f":"IF(AND(AB163>=#REF!,AB163<(#REF!+#REF!*$A$80)),#REF!,0)","v":{"$error":"#REF!"}},{"$error":"#REF!"},{"$f":"IF(AND(AD163>=#REF!,AD163<(#REF!+#REF!*$A$86)),#REF!,0)","v":{"$error":"#REF!"}},87,0,38,0,7,0,7,0,null,null,null,null,null,null,null,null,null,null,null,null,null,null,null,null,null,null,null,null,null,null,null,null,null,null,null,null,null,null,null,null,null,null,null,null,null,null,null,null,null,null,null,null,null,null,null,null,null,null,null,null,null,null,null,null,null,null,null,null,null,null,null,null,null,null,null,null,null,null,null,null,null,null,null,null,null,null,null,null,null,null,null,null,null,null,null,null,null,null,null,null,null,null,null,null,null,null,null,null,null,null,null,null,null,null,null,null,null,null,null,null,null,null,null,null,null,null,null,null,null,null,null,null,null,null,null,null,null,null,null,null,null,null,null,null,null,null,null,null,null,null,null,null,null,null,null,null,null,null,null,null,null,null,null,null,null,null,null,null,null,null,null,null,null,null,null,null,null,null,null,null,null,null,null,null,null,null,null,null,null,null,null,null,null,null,null,null,null,null,null,null,null,null,null,null,null,null,null,null,null,null,null,null,null,null,null,null,null,null,null,null,1999]
[null,null,null,null,null,7,"2022-03-01",null,null,{"$f":"IF(F164<=$AN$149,0,Apoio!E43)","v":0},null,null,0,null,0,null,null,null,0,null,null,null,null,null,null,null,null,{"$error":"#REF!"},{"$f":"IF(AND(AB164>=#REF!,AB164<(#REF!+#REF!*$A$80)),#REF!,0)","v":{"$error":"#REF!"}},{"$error":"#REF!"},{"$f":"IF(AND(AD164>=#REF!,AD164<(#REF!+#REF!*$A$86)),#REF!,0)","v":{"$error":"#REF!"}},99,0,38,0,8,0,8,0]
[null,null,null,null,null,8,"2022-04-01",null,null,{"$f":"IF(F165<=$AN$149,0,Apoio!E44)","v":0},null,null,0,null,0,null,null,null,0,null,null,null,null,null,null,null,null,{"$error":"#REF!"},{"$f":"IF(AND(AB165>=#REF!,AB165<(#REF!+#REF!*$A$80)),#REF!,0)","v":{"$error":"#REF!"}},{"$error":"#REF!"},{"$f":"IF(AND(AD165>=#REF!,AD165<(#REF!+#REF!*$A$86)),#REF!,0)","v":{"$error":"#REF!"}},111,0,38,0,9,0,9,0]
[null,null,null,null,null,9,"2022-05-01",null,null,{"$f":"IF(F166<=$AN$149,0,Apoio!E45)","v":0},null,null,0,null,0,null,null,null,0,null,null,null,null,null,null,null,null,{"$error":"#REF!"},{"$f":"IF(AND(AB166>=#REF!,AB166<(#REF!+#REF!*$A$80)),#REF!,0)","v":{"$error":"#REF!"}},{"$error":"#REF!"},{"$f":"IF(AND(AD166>=#REF!,AD166<(#REF!+#REF!*$A$86)),#REF!,0)","v":{"$error":"#REF!"}},123,0,38,0,10,0,10,0]
[null,null,null,null,null,10,"2022-06-01",null,null,{"$f":"IF(F167<=$AN$149,0,Apoio!E46)","v":0},null,null,0,null,0,null,null,null,0,null,null,null,null,null,null,null,null,{"$error":"#REF!"},{"$f":"IF(AND(AB167>=#REF!,AB167<(#REF!+#REF!*$A$80)),#REF!,0)","v":{"$error":"#REF!"}},{"$error":"#REF!"},{"$f":"IF(AND(AD167>=#REF!,AD167<(#REF!+#REF!*$A$86)),#REF!,0)","v":{"$error":"#REF!"}},135,0,38,0,11,0,11,0]
[null,null,null,null,null,11,"2022-07-01",null,null,{"$f":"IF(F168<=$AN$149,0,Apoio!E47)","v":0},null,null,0,null,0,null,null,null,0,null,null,null,null,null,null,null,null,{"$error":"#REF!"},{"$f":"IF(AND(AB168>=#REF!,AB168<(#REF!+#REF!*$A$80)),#REF!,0)","v":{"$error":"#REF!"}},{"$error":"#REF!"},{"$f":"IF(AND(AD168>=#REF!,AD168<(#REF!+#REF!*$A$86)),#REF!,0)","v":{"$error":"#REF!"}},147,0,38,0,12,0,12,0]
[null,null,null,null,null,12,"2022-08-01",null,null,{"$f":"IF(F169<=$AN$149,0,Apoio!E48)","v":0},null,null,0,null,0,null,null,null,0,null,null,null,null,null,null,null,null,{"$error":"#REF!"},{"$f":"IF(AND(AB169>=#REF!,AB169<(#REF!+#REF!*$A$80)),#REF!,0)","v":{"$error":"#REF!"}},{"$error":"#REF!"},{"$f":"IF(AND(AD169>=#REF!,AD169<(#REF!+#REF!*$A$86)),#REF!,0)","v":{"$error":"#REF!"}},159,0,38,0,13,0,13,0]
[null,null,null,null,null,13,"2022-09-01",null,null,{"$f":"IF(F170<=$AN$149,0,Apoio!E49)","v":0},null,null,0,null,0,null,null,null,0,null,null,null,null,null,null,null,null,{"$error":"#REF!"},{"$f":"IF(AND(AB170>=#REF!,AB170<(#REF!+#REF!*$A$80)),#REF!,0)","v":{"$error":"#REF!"}},{"$error":"#REF!"},{"$f":"IF(AND(AD170>=#REF!,AD170<(#REF!+#REF!*$A$86)),#REF!,0)","v":{"$error":"#REF!"}},171,0,38,0,14,0,14,0]
[null,null,null,null,null,14,"2022-10-01",null,null,{"$f":"IF(F171<=$AN$149,0,Apoio!E50)","v":0},null,null,0,null,0,null,null,null,0,null,null,null,null,null,null,null,null,{"$error":"#REF!"},{"$f":"IF(AND(AB171>=#REF!,AB171<(#REF!+#REF!*$A$80)),#REF!,0)","v":{"$error":"#REF!"}},{"$error":"#REF!"},{"$f":"IF(AND(AD171>=#REF!,AD171<(#REF!+#REF!*$A$86)),#REF!,0)","v":{"$error":"#REF!"}},183,0,38,0,15,0,15,0]
[null,null,null,null,null,15,"2022-11-01",null,null,{"$f":"IF(F172<=$AN$149,0,Apoio!E51)","v":0},null,null,2000,null,2000,null,null,null,2000,null,null,null,null,null,null,null,null,{"$error":"#REF!"},{"$f":"IF(AND(AB172>=#REF!,AB172<(#REF!+#REF!*$A$80)),#REF!,0)","v":{"$error":"#REF!"}},{"$error":"#REF!"},{"$f":"IF(AND(AD172>=#REF!,AD172<(#REF!+#REF!*$A$86)),#REF!,0)","v":{"$error":"#REF!"}},195,0,38,0,16,0,16,0]
[null,null,null,null,null,16,"2022-12-01",null,null,{"$f":"IF(F173<=$AN$149,0,Apoio!E52)","v":0},null,null,0,null,0,null,null,null,0,null,null,null,null,null,null,null,null,{"$error":"#REF!"},{"$f":"IF(AND(AB173>=#REF!,AB173<(#REF!+#REF!*$A$80)),#REF!,0)","v":{"$error":"#REF!"}},{"$error":"#REF!"},{"$f":"IF(AND(AD173>=#REF!,AD173<(#REF!+#REF!*$A$86)),#REF!,0)","v":{"$error":"#REF!"}},207,0,38,0,17,0,17,0]
[null,null,null,null,null,17,"2023-01-01",null,null,{"$f":"IF(F174<=$AN$149,0,Apoio!E53)","v":0},null,null,0,null,0,null,null,null,0,null,null,null,null,null,null,null,null,{"$error":"#REF!"},{"$f":"IF(AND(AB174>=#REF!,AB174<(#REF!+#REF!*$A$80)),#REF!,0)","v":{"$error":"#REF!"}},{"$error":"#REF!"},{"$f":"IF(AND(AD174>=#REF!,AD174<(#REF!+#REF!*$A$86)),#REF!,0)","v":{"$error":"#REF!"}},219,0,38,0,18,0,18,0]
[null,null,null,null,null,18,"2023-02-01",null,null,{"$f":"IF(F175<=$AN$149,0,Apoio!E54)","v":0},null,null,0,null,0,null,null,null,0,null,null,null,null,null,null,null,null,{"$error":"#REF!"},{"$f":"IF(AND(AB175>=#REF!,AB175<(#REF!+#REF!*$A$80)),#REF!,0)","v":{"$error":"#REF!"}},{"$error":"#REF!"},{"$f":"IF(AND(AD175>=#REF!,AD175<(#REF!+#REF!*$A$86)),#REF!,0)","v":{"$error":"#REF!"}},231,0,38,0,19,0,19,0]
[null,null,null,null,null,19,"2023-03-01",null,null,{"$f":"IF(F176<=$AN$149,0,Apoio!E55)","v":0},null,null,0,null,0,null,null,null,0,null,null,null,null,null,null,null,null,{"$error":"#REF!"},{"$f":"IF(AND(AB176>=#REF!,AB176<(#REF!+#REF!*$A$80)),#REF!,0)","v":{"$error":"#REF!"}},{"$error":"#REF!"},{"$f":"IF(AND(AD176>=#REF!,AD176<(#REF!+#REF!*$A$86)),#REF!,0)","v":{"$error":"#REF!"}},243,0,38,0,20,0,20,0]
[null,null,null,null,null,20,"2023-04-01",null,null,{"$f":"IF(F177<=$AN$149,0,Apoio!E56)","v":0},null,null,0,null,0,null,null,null,0,null,null,null,null,null,null,null,null,{"$error":"#REF!"},{"$f":"IF(AND(AB177>=#REF!,AB177<(#REF!+#REF!*$A$80)),#REF!,0)","v":{"$error":"#REF!"}},{"$error":"#REF!"},{"$f":"IF(AND(AD177>=#REF!,AD177<(#REF!+#REF!*$A$86)),#REF!,0)","v":{"$error":"#REF!"}},255,0,38,0,21,0,21,0]
[null,null,null,null,null,21,"2023-05-01",null,null,{"$f":"IF(F178<=$AN$149,0,Apoio!E57)","v":0},null,null,0,null,0,null,null,null,0,null,null,null,null,null,null,null,null,{"$error":"#REF!"},{"$f":"IF(AND(AB178>=#REF!,AB178<(#REF!+#REF!*$A$80)),#REF!,0)","v":{"$error":"#REF!"}},{"$error":"#REF!"},{"$f":"IF(AND(AD178>=#REF!,AD178<(#REF!+#REF!*$A$86)),#REF!,0)","v":{"$error":"#REF!"}},267,0,38,0,22,0,22,0]
[null,null,null,null,null,22,"2023-06-01",null,null,{"$f":"IF(F179<=$AN$149,0,Apoio!E58)","v":0},null,null,0,null,0,null,null,null,0,null,null,null,null,null,null,null,null,{"$error":"#REF!"},{"$f":"IF(AND(AB179>=#REF!,AB179<(#REF!+#REF!*$A$80)),#REF!,0)","v":{"$error":"#REF!"}},{"$error":"#REF!"},{"$f":"IF(AND(AD179>=#REF!,AD179<(#REF!+#REF!*$A$86)),#REF!,0)","v":{"$error":"#REF!"}},279,0,38,0,23,0,23,0]
[null,null,null,null,null,23,"2023-07-01",null,null,{"$f":"IF(F180<=$AN$149,0,Apoio!E59)","v":0},null,null,0,null,0,null,null,null,0,null,null,null,null,null,null,null,null,{"$error":"#REF!"},{"$f":"IF(AND(AB180>=#REF!,AB180<(#REF!+#REF!*$A$80)),#REF!,0)","v":{"$error":"#REF!"}},{"$error":"#REF!"},{"$f":"IF(AND(AD180>=#REF!,AD180<(#REF!+#REF!*$A$86)),#REF!,0)","v":{"$error":"#REF!"}},291,0,38,0,24,0,24,0]
[null,null,null,null,null,24,"2023-08-01",null,null,{"$f":"IF(F181<=$AN$149,0,Apoio!E60)","v":0},null,null,0,null,0,null,null,null,0,null,null,null,null,null,null,null,null,{"$error":"#REF!"},{"$f":"IF(AND(AB181>=#REF!,AB181<(#REF!+#REF!*$A$80)),#REF!,0)","v":{"$error":"#REF!"}},{"$error":"#REF!"},{"$f":"IF(AND(AD181>=#REF!,AD181<(#REF!+#REF!*$A$86)),#REF!,0)","v":{"$error":"#REF!"}},303,0,38,0,25,0,25,0]
[null,null,null,null,null,25,"2023-09-01",null,null,{"$f":"IF(F182<=$AN$149,0,Apoio!E61)","v":0},null,null,0,null,0,null,null,null,0,null,null,null,null,null,null,null,null,{"$error":"#REF!"},{"$f":"IF(AND(AB182>=#REF!,AB182<(#REF!+#REF!*$A$80)),#REF!,0)","v":{"$error":"#REF!"}},{"$error":"#REF!"},{"$f":"IF(AND(AD182>=#REF!,AD182<(#REF!+#REF!*$A$86)),#REF!,0)","v":{"$error":"#REF!"}},315,0,38,0,26,0,26,0]
[null,null,null,null,null,26,"2023-10-01",null,null,{"$f":"IF(F183<=$AN$149,0,Apoio!E62)","v":0},null,null,0,null,0,null,null,null,0,null,null,null,null,null,null,null,null,{"$error":"#REF!"},{"$f":"IF(AND(AB183>=#REF!,AB183<(#REF!+#REF!*$A$80)),#REF!,0)","v":{"$error":"#REF!"}},{"$error":"#REF!"},{"$f":"IF(AND(AD183>=#REF!,AD183<(#REF!+#REF!*$A$86)),#REF!,0)","v":{"$error":"#REF!"}},327,0,38,0,27,0,27,0]
[null,null,null,null,null,27,"2023-11-01",null,null,{"$f":"IF(F184<=$AN$149,0,Apoio!E63)","v":0},null,null,2000,null,2000,null,null,null,2000,null,null,null,null,null,null,null,null,{"$error":"#REF!"},{"$f":"IF(AND(AB184>=#REF!,AB184<(#REF!+#REF!*$A$80)),#REF!,0)","v":{"$error":"#REF!"}},{"$error":"#REF!"},{"$f":"IF(AND(AD184>=#REF!,AD184<(#REF!+#REF!*$A$86)),#REF!,0)","v":{"$error":"#REF!"}},339,0,38,0,28,0,28,0]
[null,null,null,null,null,28,"2023-12-01",null,null,{"$f":"IF(F185<=$AN$149,0,Apoio!E64)","v":0},null,null,0,null,0,null,null,null,0,null,null,null,null,null,null,null,null,{"$error":"#REF!"},{"$f":"IF(AND(AB185>=#REF!,AB185<(#REF!+#REF!*$A$80)),#REF!,0)","v":{"$error":"#REF!"}},{"$error":"#REF!"},{"$f":"IF(AND(AD185>=#REF!,AD185<(#REF!+#REF!*$A$86)),#REF!,0)","v":{"$error":"#REF!"}},351,0,38,0,29,0,29,0]
[null,null,null,null,null,29,"2024-01-01",null,null,{"$f":"IF(F186<=$AN$149,0,Apoio!E65)","v":0},null,null,0,null,0,null,null,null,0,null,null,null,null,null,null,null,null,{"$error":"#REF!"},{"$f":"IF(AND(AB186>=#REF!,AB186<(#REF!+#REF!*$A$80)),#REF!,0)","v":{"$error":"#REF!"}},{"$error":"#REF!"},{"$f":"IF(AND(AD186>=#REF!,AD186<(#REF!+#REF!*$A$86)),#REF!,0)","v":{"$error":"#REF!"}},363,0,38,0,30,0,30,0]
[null,null,null,null,null,30,"2024-02-01",null,null,{"$f":"IF(F187<=$AN$149,0,Apoio!E66)","v":0},null,null,0,null,0,null,null,null,0,null,null,null,null,null,null,null,null,{"$error":"#REF!"},{"$f":"IF(AND(AB187>=#REF!,AB187<(#REF!+#REF!*$A$80)),#REF!,0)","v":{"$error":"#REF!"}},{"$error":"#REF!"},{"$f":"IF(AND(AD187>=#REF!,AD187<(#REF!+#REF!*$A$86)),#REF!,0)","v":{"$error":"#REF!"}},375,0,38,0,31,0,31,0]
[null,null,null,null,null,31,"2024-03-01",null,null,{"$f":"IF(F188<=$AN$149,0,Apoio!E67)","v":0},null,null,0,null,0,null,null,null,0,null,null,null,null,null,null,null,null,{"$error":"#REF!"},{"$f":"IF(AND(AB188>=#REF!,AB188<(#REF!+#REF!*$A$80)),#REF!,0)","v":{"$error":"#REF!"}},{"$error":"#REF!"},{"$f":"IF(AND(AD188>=#REF!,AD188<(#REF!+#REF!*$A$86)),#REF!,0)","v":{"$error":"#REF!"}},387,0,38,0,32,0,32,0]
[null,null,null,null,null,32,"2024-04-01",null,null,{"$f":"IF(F189<=$AN$149,0,Apoio!E68)","v":0},null,null,0,null,0,null,null,null,0,null,null,null,null,null,null,null,null,{"$error":"#REF!"},{"$f":"IF(AND(AB189>=#REF!,AB189<(#REF!+#REF!*$A$80)),#REF!,0)","v":{"$error":"#REF!"}},{"$error":"#REF!"},{"$f":"IF(AND(AD189>=#REF!,AD189<(#REF!+#REF!*$A$86)),#REF!,0)","v":{"$error":"#REF!"}},399,0,38,0,33,0,33,0]
[null,null,null,null,null,33,"2024-05-01",null,null,{"$f":"IF(F190<=$AN$149,0,Apoio!E69)","v":0},null,null,0,null,0,null,null,null,0,null,null,null,null,null,null,null,null,{"$error":"#REF!"},{"$f":"IF(AND(AB190>=#REF!,AB190<(#REF!+#REF!*$A$80)),#REF!,0)","v":{"$error":"#REF!"}},{"$error":"#REF!"},{"$f":"IF(AND(AD190>=#REF!,AD190<(#REF!+#REF!*$A$86)),#REF!,0)","v":{"$error":"#REF!"}},411,0,38,0,34,0,34,0]
[null,null,null,null,null,34,"2024-06-01",null,null,{"$f":"IF(F191<=$AN$149,0,Apoio!E70)","v":0},null,null,0,null,0,null,null,null,0,null,null,null,null,null,null,null,null,{"$error":"#REF!"},{"$f":"IF(AND(AB191>=#REF!,AB191<(#REF!+#REF!*$A$80)),#REF!,0)","v":{"$error":"#REF!"}},{"$error":"#REF!"},{"$f":"IF(AND(AD191>=#REF!,AD191<(#REF!+#REF!*$A$86)),#REF!,0)","v":{"$error":"#REF!"}},423,0,38,0,35,0,35,0]
[null,null,null,null,null,35,"2024-07-01",null,null,{"$f":"IF(F192<=$AN$149,0,Apoio!E71)","v":0},null,null,0,null,0,null,null,null,0,null,null,null,null,null,null,null,null,{"$f":"AB191+$A$80","v":{"$error":"#REF!"}},{"$f":"IF(AND(AB192>=#REF!,AB192<(#REF!+#REF!*$A$80)),#REF!,0)","v":{"$error":"#REF!"}},{"$f":"AD191+$A$86","v":{"$error":"#REF!"}},{"$f":"IF(AND(AD192>=#REF!,AD192<(#REF!+#REF!*$A$86)),#REF!,0)","v":{"$error":"#REF!"}},{"$f":"AF191+$A$88","v":435},0,{"$f":"AH191+$A$90","v":38},0,36,0,36,0]
[null,null,null,null,null,36,"2024-08-01",null,null,{"$f":"IF(F193<=$AN$149,0,Apoio!E72)","v":0},null,null,0,null,0,null,null,null,0,null,null,null,null,null,null,null,null,{"$error":"#REF!"},{"$f":"IF(AND(AB193>=#REF!,AB193<(#REF!+#REF!*$A$80)),#REF!,0)","v":{"$error":"#REF!"}},{"$error":"#REF!"},{"$f":"IF(AND(AD193>=#REF!,AD193<(#REF!+#REF!*$A$86)),#REF!,0)","v":{"$error":"#REF!"}},447,0,38,0,37,0,37,100]
[null,null,null,null,null,37,"2024-09-01",null,null,{"$f":"IF(F194<=$AN$149,0,Apoio!E73)","v":0},null,null,100,null,100,null,null,null,0,null,null,null,null,null,null,null,null,{"$error":"#REF!"},{"$f":"IF(AND(AB194>=#REF!,AB194<(#REF!+#REF!*$A$80)),#REF!,0)","v":{"$error":"#REF!"}},{"$error":"#REF!"},{"$f":"IF(AND(AD194>=#REF!,AD194<(#REF!+#REF!*$A$86)),#REF!,0)","v":{"$error":"#REF!"}},459,0,38,0,38,0,38,0]
[null,null,null,null,null,38,"2024-10-01",null,null,{"$f":"IF(F195<=$AN$149,0,Apoio!E74)","v":0},null,null,0,null,0,null,null,null,0,null,null,null,null,null,null,null,null,{"$error":"#REF!"},{"$f":"IF(AND(AB195>=#REF!,AB195<(#REF!+#REF!*$A$80)),#REF!,0)","v":{"$error":"#REF!"}},{"$error":"#REF!"},{"$f":"IF(AND(AD195>=#REF!,AD195<(#REF!+#REF!*$A$86)),#REF!,0)","v":{"$error":"#REF!"}},471,0,38,0,39,0,39,0]
[null,null,null,null,null,39,"2024-11-01",null,null,{"$f":"IF(F196<=$AN$149,0,Apoio!E75)","v":0},null,null,0,null,0,null,null,null,0,null,null,null,null,null,null,null,null,{"$error":"#REF!"},{"$f":"IF(AND(AB196>=#REF!,AB196<(#REF!+#REF!*$A$80)),#REF!,0)","v":{"$error":"#REF!"}},{"$error":"#REF!"},{"$f":"IF(AND(AD196>=#REF!,AD196<(#REF!+#REF!*$A$86)),#REF!,0)","v":{"$error":"#REF!"}},483,0,38,0,40,0,40,0]
[null,null,null,null,null,40,"2024-12-01",null,null,{"$f":"IF(F197<=$AN$149,0,Apoio!E76)","v":0},null,null,0,null,0,null,null,null,0,null,null,null,null,null,null,null,null,{"$error":"#REF!"},{"$f":"IF(AND(AB197>=#REF!,AB197<(#REF!+#REF!*$A$80)),#REF!,0)","v":{"$error":"#REF!"}},{"$error":"#REF!"},{"$f":"IF(AND(AD197>=#REF!,AD197<(#REF!+#REF!*$A$86)),#REF!,0)","v":{"$error":"#REF!"}},495,0,38,0,41,0,41,0]
[null,null,null,null,null,null,null,null,null,null,null,null,null,null,null,null,null,null,null,null,null,null,null,null,null,null,null,1,0,1,0,1,0,1,0,1,0,1,0]
[null,null,null,null,null,null,null,null,null,null,null,null,null,null,null,null,null,null,null,null,null,null,null,null,null,null,null,2,0,2,0,2,0,2,0,2,0,2,0]
[null,null,null,null,null,null,null,null,null,null,null,null,null,null,null,null,null,null,null,null,null,null,null,null,null,null,null,3,0,3,0,3,0,3,0,3,0,3,0]
[null,null,null,null,null,null,null,null,null,null,null,null,null,null,null,null,null,null,null,null,null,null,null,null,null,null,null,4,0,4,0,4,0,4,0,4,0,4,0]
[null,null,null,null,null,null,null,null,null,null,null,null,null,null,null,null,null,null,null,null,null,null,null,null,null,null,null,5,0,5,0,5,0,5,0,5,0,5,0]
[null,null,null,null,null,null,null,null,null,null,null,null,null,null,null,null,null,null,null,null,null,null,null,null,null,null,null,6,0,6,0,6,0,6,0,6,0,6,0]
[null,null,null,null,null,null,null,null,null,null,null,null,null,null,null,null,null,null,null,null,null,null,null,null,null,null,null,7,0,7,0,7,0,7,0,7,0,7,0]
[null,null,null,null,null,null,null,null,null,null,null,null,null,null,null,null,null,null,null,null,null,null,null,null,null,null,null,8,0,8,0,8,0,8,0,8,0,8,0]
[null,null,null,null,null,null,null,null,null,null,null,null,null,null,null,null,null,null,null,null,null,null,null,null,null,null,null,9,0,9,0,9,0,9,0,9,0,9,0]
[null,null,null,null,null,null,null,null,null,null,null,null,null,null,null,null,null,null,null,null,null,null,null,null,null,null,null,10,0,10,0,10,0,10,0,10,0,10,0]
[null,null,null,null,null,null,null,null,null,null,null,null,null,null,null,null,null,null,null,null,null,null,null,null,null,null,null,11,0,11,0,11,0,11,0,11,0,11,0]
[null,null,null,null,null,null,null,null,null,null,null,null,null,null,null,null,null,null,null,null,null,null,null,null,null,null,null,12,0,12,0,12,0,12,0,12,0,12,0]
[null,null,null,null,null,null,null,null,null,null,null,null,null,null,null,null,null,null,null,null,null,null,null,null,null,null,null,13,0,13,0,13,0,13,0,13,0,13,0]
[null,null,null,null,null,null,null,null,null,null,null,null,null,null,null,null,null,null,null,null,null,null,null,null,null,null,null,14,0,14,0,14,0,14,0,14,0,14,0]
[null,null,null,null,null,null,null,null,null,null,null,null,null,null,null,null,null,null,null,null,null,null,null,null,null,null,null,15,0,15,0,15,0,15,0,15,0,15,0]
[null,null,null,null,null,null,null,null,null,null,null,null,null,null,null,null,null,null,null,null,null,null,null,null,null,null,null,16,0,16,0,16,0,16,0,16,0,16,0]
[null,null,null,null,null,null,null,null,null,null,null,null,null,null,null,null,null,null,null,null,null,null,null,null,null,null,null,17,0,17,0,17,0,17,0,17,0,17,0]
[null,null,null,null,null,null,null,null,null,null,null,null,null,null,null,null,null,null,null,null,null,null,null,null,null,null,null,18,0,18,0,18,0,18,0,18,0,18,0]
[null,null,null,null,null,null,null,null,null,null,null,null,null,null,null,null,null,null,null,null,null,null,null,null,null,null,null,19,0,19,0,19,0,19,0,19,0,19,0]
[null,null,null,null,null,null,null,null,null,null,null,null,null,null,null,null,null,null,null,null,null,null,null,null,null,null,null,20,0,20,0,20,0,20,0,20,0,20,0]
[null,null,null,null,null,null,null,null,null,null,null,null,null,null,null,null,null,null,null,null,null,null,null,null,null,null,null,21,0,21,0,21,0,21,0,21,0,21,0]
[null,null,null,null,null,null,null,null,null,null,null,null,null,null,null,null,null,null,null,null,null,null,null,null,null,null,null,22,0,22,0,22,0,22,0,22,0,22,0]
[null,null,null,null,null,null,null,null,null,null,null,null,null,null,null,null,null,null,null,null,null,null,null,null,null,null,null,23,0,23,0,23,0,23,0,23,0,23,0]
[null,null,null,null,null,null,null,null,null,null,null,null,null,null,null,null,null,null,null,null,null,null,null,null,null,null,null,24,0,24,0,24,0,24,0,24,0,24,0]
[null,null,null,null,null,null,null,null,null,null,null,null,null,null,null,null,null,null,null,null,null,null,null,null,null,null,null,25,0,25,0,25,0,25,0,25,0,25,0]
[null,null,null,null,null,null,null,null,null,null,null,null,null,null,null,null,null,null,null,null,null,null,null,null,null,null,null,26,0,26,0,26,0,26,0,26,0,26,0]
[null,null,null,null,null,null,null,null,null,null,null,null,null,null,null,null,null,null,null,null,null,null,null,null,null,null,null,27,0,27,0,27,0,27,0,27,0,27,0]
[null,null,null,null,null,null,null,null,null,null,null,null,null,null,null,null,null,null,null,null,null,null,null,null,null,null,null,28,0,28,0,28,0,28,0,28,0,28,0]
[null,null,null,null,null,null,null,null,null,null,null,null,null,null,null,null,null,null,null,null,null,null,null,null,null,null,null,29,0,29,0,29,0,29,0,29,0,29,0]
[null,null,null,null,null,null,null,null,null,null,null,null,null,null,null,null,null,null,null,null,null,null,null,null,null,null,null,30,0,30,0,30,0,30,0,30,0,30,0]
[null,null,null,null,null,null,null,null,null,null,null,null,null,null,null,null,null,null,null,null,null,null,null,null,null,null,null,31,0,31,0,31,0,31,0,31,0,31,0]
[null,null,null,null,null,null,null,null,null,null,null,null,null,null,null,null,null,null,null,null,null,null,null,null,null,null,null,32,0,32,0,32,0,32,0,32,0,32,0]
[null,null,null,null,null,null,null,null,null,null,null,null,null,null,null,null,null,null,null,null,null,null,null,null,null,null,null,33,0,33,0,33,0,33,0,33,0,33,0]
[null,null,null,null,null,null,null,null,null,null,null,null,null,null,null,null,null,null,null,null,null,null,null,null,null,null,null,34,0,34,0,34,0,34,0,34,0,34,0]
[null,null,null,null,null,null,null,null,null,null,null,null,null,null,null,null,null,null,null,null,null,null,null,null,null,null,null,35,0,35,0,35,0,35,0,35,0,35,0]
[null,null,null,null,null,null,null,null,null,null,null,null,null,null,null,null,null,null,null,null,null,null,null,null,null,null,null,36,0,36,0,36,0,36,0,36,0,36,0]
[null,null,null,null,null,null,null,null,null,null,null,null,null,null,null,null,null,null,null,null,null,null,null,null,null,null,null,37,0,37,0,37,0,37,0,37,0,37,0]
[null,null,null,null,null,null,null,null,null,null,null,null,null,null,null,null,null,null,null,null,null,null,null,null,null,null,null,38,0,38,0,38,0,38,0,38,0,38,0]
[null,null,null,null,null,null,null,null,null,null,null,null,null,null,null,null,null,null,null,null,null,null,null,null,null,null,null,39,0,39,0,39,0,39,0,39,0,39,0]
[null,null,null,null,null,null,null,null,null,null,null,null,null,null,null,null,null,null,null,null,null,null,null,null,null,null,null,40,0,40,0,40,0,40,0,40,0,40,0]
[null,null,null,null,null,null,null,null,null,null,null,null,null,null,null,null,null,null,null,null,null,null,null,null,null,null,null,41,0,41,0,41,0,41,0,41,0,41,0]
[null,null,null,null,null,null,null,null,null,null,null,null,null,null,null,null,null,null,null,null,null,null,null,null,null,null,null,42,0,42,0,42,0,42,0,42,0,42,0]

{"sheet":"Proposta 1 Via","index":1,"n_rows":92,"n_cols":27,"rows_kept":92,"cut":false,"hidden":true,"merged":[[91,4,91,5],[91,6,91,7],[13,5,14,6],[85,4,87,6],[89,4,89,7],[79,4,80,6],[73,4,73,5],[40,4,41,4],[13,4,14,4],[37,4,37,7],[40,8,40,9],[84,4,84,6],[84,7,84,9],[65,4,65,7],[13,8,13,9],[40,5,41,6],[69,6,69,7],[74,4,74,5],[72,4,72,5],[2,13,2,14],[40,14,41,14],[40,12,41,12],[13,12,14,12],[40,13,41,13],[2,11,2,12],[8,11,8,12],[13,10,13,11],[40,10,40,11],[39,13,39,14],[84,10,84,12],[79,7,80,9],[69,4,70,5],[71,4,71,5],[79,10,80,12],[78,10,78,12],[78,7,78,9],[69,8,69,10],[69,11,69,12],[78,4,78,6]]}
["*",null,null,null,"Documento Interno para Equalização de Propostas"]
["*",null,null,null,"Não tem Valor Comercial ou Jurídico"]
["*",null,null,null,null,null,null,null,null,null,null,{"$f":"NOW()","v":"2021-09-01T12:07:46.510"},null,"Impressão"]
["*"]
["*",null,null,null,"Empreendimento",null,{"$f":"'Simulador CEF'!G4:P4","v":"Completo Guanabara - Desconto - Sem Premio"},null,null,"Cargo",null,"Nome",null,null,null,null,null,null,null,null,null,null,null,null,"Anual","Fixa","HUMANARI / CYAN"]
["*",null,null,null,"Proponente",null,null,null,null,"Corretor",null,null,null,null,null,null,null,null,null,null,null,null,null,null,"Chaves","Corrigida","HUMANARI / MAGENTA"]
["*",null,null,null,"Unidade",null,null,null,null,"Gerente",null,null,null,null,null,null,null,null,null,null,null,null,null,null,"Mensal",null,"HUMANARI / RUBINE"]
["*",null,null,null,null,null,null,null,null,"Empresa de vendas",null,null,null,null,null,null,null,null,null,null,null,null,null,null,"Semestral",null,"HUMANARI / VAGAS GARAGEM"]
["*",null,null,null,"Data da Tabela",null,"2021-09-01","Juros TP a.a.",6.1677999999999997E-2,"Data TP Tabela",{"$f":"G11","v":"2024-01-10"},"Reajuste INCCD2",null,null,null,null,null,null,null,null,null,null,null,null,"Sinal"]
["*",null,null,null,"Data da proposta",null,{"$f":"'Simulador CEF'!I12","v":"2021-09-01"},"Juros Mercado a.a.",0.12,"Data TP Proposta",{"$f":"G11","v":"2024-01-10"}]
["*",null,null,null,"Data das Chaves:",null,{"$f":"'Simulador CEF'!S10","v":"2024-01-10"},"Preço da unidade",{"$f":"+J38","v":160140}]
["*"]
["*",null,null,null,"TABELA DE VENDAS"]
["*",null,null,null,"Parc.","Periodicidade",null,"Data","Parcelas Sem TP",null,"Parcelas Com TP",null,"Valor Presente"]
["*",null,null,null,null,null,null,"Inicial","Parcelas","Total","Parcelas","Total"]
[{"$f":"IF(E16=\"\",\"\",IF(E16=0,\"\",\"*\"))","v":"*"},{"$f":"IF(H16<=$E$86,\"A\",\"B\")","v":"A"},{"$f":"13589.79/388279.75","v":3.4999996780671672E-2},{"$f":"IF(F16=\"Chaves\",((1+$I$9)^(1/12)-1),IF(F16=\"Anual\",$I$9,IF(F16=\"Semestral\",((1+$I$9)^(1/2)-1),IF(F16=\"Mensal\",((1+$I$9)^(1/12)-1),IF(F16=\"Sinal\",0)))))","v":0},{"$f":"'Simulador CEF'!J37","v":1},"Sinal","Fixa",{"$f":"'Simulador CEF'!G37","v":"2021-09-01"},{"$f":"'Simulador CEF'!M37","v":2201.9250000000002},{"$f":"I16*E16","v":2201.9250000000002},{"$f":"IF(H16<=$E$86,I16,   -PMT(D16,E16, (-FV(((1+$I$9)^(1/12)-1),( VLOOKUP(H16,Mês,2) ),,M16)),,1)       )","v":2201.9250000000002},{"$f":"K16*E16","v":2201.9250000000002},{"$f":"IF(E16=\"\",0,IF(H16<=$E$86,-PV(((1+$I$9)^(1/12)-1),( VLOOKUP(H16,Mês,2) ),,(-PV((IF(F16=\"Anual\",$I$9,IF(F16=\"Semestral\",((1+$I$9)^(1/2)-1),((1+$I$9)^(1/12)-1)))),E16,I16,,1)),1),-PV(((1+$I$9)^(1/12)-1),( VLOOKUP($E$86,Mês,2) ),,J16,1)))","v":2201.9250000000002}]
[{"$f":"IF(E19=\"\",\"\",IF(E19=0,\"\",\"*\"))","v":"*"},"A",{"$f":"8736.29/388279.75","v":2.2499988732350838E-2},5.0000148409872214E-3,{"$f":"'Simulador CEF'!J39","v":1},"Mensal","Corrigida",{"$f":"'Simulador CEF'!G39","v":"2021-10-01"},{"$f":"'Simulador CEF'!M39","v":2201.9250000000002},{"$f":"I17*E17","v":2201.9250000000002},{"$f":"IF(H17<=$E$86,I17,   -PMT(D17,E17, (-FV(((1+$I$9)^(1/12)-1),( VLOOKUP(H17,Mês,2) ),,M17)),,1)       )","v":2201.9250000000002},{"$f":"K17*E17","v":2201.9250000000002},2190.9701168993438]
[{"$f":"IF(E20=\"\",\"\",IF(E20=0,\"\",\"*\"))","v":"*"},"A",{"$f":"8736.29/388279.75","v":2.2499988732350838E-2},5.0000148409872214E-3,{"$f":"'Simulador CEF'!J41","v":2},"Mensal","Corrigida",{"$f":"'Simulador CEF'!G41","v":"2021-11-01"},{"$f":"'Simulador CEF'!M41","v":2201.9250000000002},4403.8500000000004,{"$f":"IF(H18<=$E$86,I18,   -PMT(D18,E18, (-FV(((1+$I$9)^(1/12)-1),( VLOOKUP(H18,Mês,2) ),,M18)),,1)       )","v":2201.9250000000002},4403.8500000000004,4349.2933216091305]
[{"$f":"IF(E23=\"\",\"\",IF(E23=0,\"\",\"*\"))","v":"*"},"A",{"$f":"1698.72/388279.75","v":4.3749899395989621E-3},6.1677999999999997E-2,{"$f":"'Simulador CEF'!J43","v":2},"Anual","Corrigida",{"$f":"'Simulador CEF'!G43","v":"2022-12-01"},{"$f":"'Simulador CEF'!M43","v":800.7},1601.4,{"$f":"IF(H19<=$E$86,I19,   -PMT(D17,E19, (-FV(((1+$I$9)^(1/12)-1),( VLOOKUP(H19,Mês,2) ),,M19)),,1)       )","v":800.7},1601.4,1442.8022953088689]
[{"$f":"IF(E24=\"\",\"\",IF(E24=0,\"\",\"*\"))","v":"*"},"A",{"$f":"11648.39/388279.75","v":2.9999993561343336E-2},5.0000148409872214E-3,{"$f":"'Simulador CEF'!J45","v":2},"Mensal","Corrigida",{"$f":"'Simulador CEF'!G45","v":"2022-01-01"},{"$f":"'Simulador CEF'!M45","v":240.21},480.42,{"$f":"IF(H20<=$E$86,I20,   -PMT(D18,E20, (-FV(((1+$I$9)^(1/12)-1),( VLOOKUP(H20,Mês,2) ),,M20)),,1)       )","v":240.21},480.42,469.75901422664555]
[{"$f":"IF(E25=\"\",\"\",IF(E25=0,\"\",\"*\"))","v":"*"},"A",{"$f":"11648.39/388279.75","v":2.9999993561343336E-2},{"$f":"IF(F21=\"Chaves\",((1+$I$9)^(1/12)-1),IF(F21=\"Anual\",$I$9,IF(F21=\"Semestral\",((1+$I$9)^(1/2)-1),IF(F21=\"Mensal\",((1+$I$9)^(1/12)-1),IF(F21=\"Sinal\",0)))))","v":5.0000148409872214E-3},{"$f":"'Simulador CEF'!J47","v":9},"Mensal","Corrigida",{"$f":"'Simulador CEF'!G47","v":"2022-03-01"},{"$f":"'Simulador CEF'!M47","v":160.14000000000001},1441.2600000000002,{"$f":"IF(H21<=$E$86,I21,   -PMT(D19,E21, (-FV(((1+$I$9)^(1/12)-1),( VLOOKUP(H21,Mês,2) ),,M21)),,1)       )","v":160.14000000000001},1441.2600000000002,1371.2532269097605]
[{"$f":"IF(E26=\"\",\"\",IF(E26=0,\"\",\"*\"))","v":""},"A",{"$f":"11648.39/388279.75","v":2.9999993561343336E-2},{"$f":"IF(F22=\"Chaves\",((1+$I$9)^(1/12)-1),IF(F22=\"Anual\",$I$9,IF(F22=\"Semestral\",((1+$I$9)^(1/2)-1),IF(F22=\"Mensal\",((1+$I$9)^(1/12)-1),IF(F22=\"Sinal\",0)))))","v":5.0000148409872214E-3},{"$f":"'Simulador CEF'!J49","v":7},"Mensal","Corrigida",{"$f":"'Simulador CEF'!G49","v":"2022-12-01"},{"$f":"'Simulador CEF'!M49","v":160.14000000000001},1120.98,{"$f":"IF(H22<=$E$86,I22,   -PMT(D20,E22, (-FV(((1+$I$9)^(1/12)-1),( VLOOKUP(H22,Mês,2) ),,M22)),,1)       )","v":160.14000000000001},1120.98,1024.7790625552639]
[{"$f":"IF(E25=\"\",\"\",IF(E25=0,\"\",\"*\"))","v":"*"},"A",{"$f":"38827.96/388279.75","v":9.9999961368060011E-2},5.0000148409872214E-3,{"$f":"'Simulador CEF'!J53","v":6},"Mensal","Corrigida",{"$f":"'Simulador CEF'!G53","v":"2023-07-01"},{"$f":"'Simulador CEF'!M53","v":160.14000000000001},960.84000000000015,{"$f":"IF(H23<=$E$86,I23,   -PMT(D19,E23, (-FV(((1+$I$9)^(1/12)-1),( VLOOKUP(H23,Mês,2) ),,M23)),,1)       )","v":160.14000000000001},960.84000000000015,850.35086772175066]
[{"$f":"IF(#REF!=\"\",\"\",IF(#REF!=0,\"\",\"*\"))","v":{"$error":"#REF!"}},"A",{"$f":"1764.91/388279.75","v":4.5454598134463623E-3},5.0000148409872214E-3,{"$f":"'Simulador CEF'!J55","v":1},"Mensal","Corrigida",{"$f":"'Simulador CEF'!G55","v":"2024-01-01"},{"$f":"'Simulador CEF'!M55","v":1601.4},1601.4,{"$f":"IF(H24<=$E$86,I24,   -PMT(D20,E24, (-FV(((1+$I$9)^(1/12)-1),( VLOOKUP(H24,Mês,2) ),,M24)),,1)       )","v":1601.4},1601.4,1392.6754354817863]
[{"$f":"IF(#REF!=\"\",\"\",IF(#REF!=0,\"\",\"*\"))","v":{"$error":"#REF!"}},"A",{"$f":"10677.69/388279.75","v":2.7499991951679171E-2},5.0000148409872214E-3,{"$f":"'Simulador CEF'!J57","v":1},"Chaves","Corrigida",{"$f":"'Simulador CEF'!G57","v":"2021-12-01"},{"$f":"'Simulador CEF'!M57","v":144126},144126,{"$f":"IF(H25<=$E$86,I25,   -PMT(D23,E25, (-FV(((1+$I$9)^(1/12)-1),( VLOOKUP(H25,Mês,2) ),,M25)),,1)       )","v":144126},144126,141985.54379411944,null,"OBS:"]
["","A",{"$f":"0/388279.75","v":0},false,null,null,null,null,null,0,{"$f":"IF(H26<=$E$86,I26,   -PMT(D26,E26, (-FV(((1+$I$9)^(1/12)-1),( VLOOKUP(H26,Mês,2) ),,M26)),,1)       )","v":0},0,0]
["","A",0,false,null,null,null,null,null,0,0,0,0]
["","A",0,false,null,null,null,null,null,0,0,0,0]
["","A",0,false,null,null,null,null,null,0,0,0,0]
["","A",0,false,null,null,null,null,null,0,0,0,0]
["","A",0,false,null,null,null,null,null,0,0,0,0]
["","A",0,false,null,null,null,null,null,0,0,0,0]
["","A",0,false,null,null,null,null,null,0,0,0,0]
["","A",0,false,null,null,null,null,null,0,0,0,0]
["","A",0,false,null,null,null,null,null,0,0,0,0]
["","A",0,false,null,null,null,null,null,{"$f":"I36*E36","v":0},0,{"$f":"K36*E36","v":0},0]
["","A",0,false,null,null,null,null,null,{"$f":"I37*E37","v":0},0,{"$f":"K37*E37","v":0},0]
["*",null,null,null,"TOTAL",null,null,null,null,{"$f":"SUM(J16:J36)","v":160140},null,{"$f":"SUM(L16:L36)","v":160140},{"$f":"SUM(M16:M36)","v":157279.35213483198},null,null,{"$f":"J38/J66","v":0.99818613609589169}]
["*"]
["*",null,null,null,"PROPOSTA DO PROPONENTE",null,null,null,null,null,null,null,null,"Param. Comissão"]
["*",null,null,null,"Parc.","Periodicidade",null,"Data","Parcelas Sem TP",null,"Parcelas Com TP",null,"Valor Presente","%Abat. N.F.","%Abat.","Parcela para zerar PV","PV para Zerar","zerar PV"]
["*",null,null,null,null,null,null,"Inicial","Parcelas","Total","Parcelas","Total"]
[{"$f":"IF(E43=\"\",\"\",IF(E43=0,\"\",\"*\"))","v":"*"},{"$f":"IF(H43<=$E$86,\"A\",\"B\")","v":"A"},null,{"$f":"IF(F43=\"Chaves\",((1+$I$9)^(1/12)-1),IF(F43=\"Anual\",$I$9,IF(F43=\"Semestral\",((1+$I$9)^(1/2)-1),IF(F43=\"Mensal\",((1+$I$9)^(1/12)-1),IF(F43=\"Sinal\",0)))))","v":0},{"$f":"'Simulador CEF'!E65","v":1},"Sinal","Fixa",{"$f":"'Simulador CEF'!M65","v":"2021-09-01"},{"$f":"'Simulador CEF'!G65","v":3000},{"$f":"I43*E43","v":3000},{"$f":"IF(H43<=$E$86,I43,   -PMT(D43,E43, (-FV(((1+$I$9)^(1/12)-1),( VLOOKUP(H43,Mês,2) ),,M43)),,1)       )","v":3000},{"$f":"K43*E43","v":3000},{"$f":"IF(E43<1,0,IF(H43<=$E$86,-PV(((1+$I$9)^(1/12)-1),( VLOOKUP(H43,Mês,2) ),,(-PV((IF(F43=\"Anual\",$I$9,IF(F43=\"Semestral\",((1+$I$9)^(1/2)-1),((1+$I$9)^(1/12)-1)))),E43,I43,,1)),1),-PV(((1+$I$9)^(1/12)-1),( VLOOKUP($E$86,Mês,2) ),,J43,1)))","v":3000},0,1,{"$f":"IF(E43<1,0,IF(H43<=$E$86,-FV(((1+$I$9)^(1/12)-1),( VLOOKUP(H43,Mês,2) ),,(-PMT((IF(F43=\"Anual\",$I$9,IF(F43=\"Semestral\",((1+$I$9)^(1/2)-1),((1+$I$9)^(1/12)-1)))),E43,Q43,,1)),1),-PV(((1+$I$9)^(1/12)-1),( VLOOKUP($E$86,Mês,2) ),,Q43,1)))","v":3019.9778315745348},{"$f":"$M$38-$M$66+M43","v":3019.9778315745352},{"$f":"M43","v":3000}]
["*","A",null,5.0000148409872214E-3,{"$f":"'Simulador CEF'!E67","v":1},"Mensal","Corrigida",{"$f":"'Simulador CEF'!M67","v":"2021-10-01"},{"$f":"'Simulador CEF'!G67","v":1900},1900,1900,1900,1890.5472357635947,null,null,1920.0777210288984,1910.5250673381299,1890.5472357635947]
["*","A",null,5.0000148409872214E-3,{"$f":"'Simulador CEF'!E69","v":1},"Mensal","Corrigida",{"$f":"'Simulador CEF'!M69","v":"2021-11-01"},{"$f":"'Simulador CEF'!G69","v":1350},1350,1350,1350,1336.6005397180188,null,null,1370.1781099320162,1356.578371292554,1336.6005397180188]
["*","A",null,5.0000148409872214E-3,{"$f":"'Simulador CEF'!E76","v":1},"Mensal","Corrigida",{"$f":"'Simulador CEF'!M76","v":"2021-12-01"},{"$f":"'Simulador CEF'!G76","v":1350},1350,1350,1350,1329.950766149489,null,null,1370.2790007811393,1349.9285977240243,1329.950766149489]
["*","A",null,5.0000148409872214E-3,{"$f":"'Simulador CEF'!E78","v":2},"Mensal","Corrigida",{"$f":"'Simulador CEF'!M78","v":"2022-01-01"},{"$f":"'Simulador CEF'!G78","v":550},1100,550,1100,1075.5899330779528,null,null,560.21561008343815,1095.567764652488,1075.5899330779528]
[{"$f":"IF(E48=\"\",\"\",IF(E48=0,\"\",\"*\"))","v":"*"},"A",null,{"$f":"IF(F48=\"Chaves\",((1+$I$9)^(1/12)-1),IF(F48=\"Anual\",$I$9,IF(F48=\"Semestral\",((1+$I$9)^(1/2)-1),IF(F48=\"Mensal\",((1+$I$9)^(1/12)-1),IF(F48=\"Sinal\",0)))))","v":5.0000148409872214E-3},{"$f":"'Simulador CEF'!E80","v":9},"Mensal","Corrigida",{"$f":"'Simulador CEF'!M80","v":"2022-03-01"},{"$f":"'Simulador CEF'!G80","v":400},{"$f":"I48*E48","v":3600},400,{"$f":"K48*E48","v":3600},3425.1360732103421,null,null,402.33308471809926,3445.1139047848774,3425.1360732103421]
["*","A",null,5.0000148409872214E-3,{"$f":"'Simulador CEF'!E82","v":7},"Mensal","Corrigida",{"$f":"'Simulador CEF'!M82","v":"2022-12-01"},{"$f":"'Simulador CEF'!G82","v":300},2100,300,2100,1919.7809339738922,null,null,303.12189238172812,1939.7587655484274,1919.7809339738922]
[{"$f":"IF(E50=\"\",\"\",IF(E50=0,\"\",\"*\"))","v":"*"},"A",null,{"$f":"IF(F50=\"Chaves\",((1+$I$9)^(1/12)-1),IF(F50=\"Anual\",$I$9,IF(F50=\"Semestral\",((1+$I$9)^(1/2)-1),IF(F50=\"Mensal\",((1+$I$9)^(1/12)-1),IF(F50=\"Sinal\",0)))))","v":5.0000148409872214E-3},{"$f":"'Simulador CEF'!E84","v":6},"Mensal","Corrigida",{"$f":"'Simulador CEF'!M84","v":"2023-07-01"},{"$f":"'Simulador CEF'!G84","v":200},1200,200,{"$f":"K50*E50","v":1200},1062.0093264915083,null,null,203.7622704577436,1081.9871580660435,1062.0093264915083]
["*","A",null,5.0000148409872214E-3,{"$f":"'Simulador CEF'!E86:F86","v":1},"Mensal","Corrigida",{"$f":"'Simulador CEF'!M86","v":"2024-01-01"},{"$f":"'Simulador CEF'!G86","v":1070},1070,1070,{"$f":"K51*E51","v":1070},930.53747718590682,null,null,1092.9719708328114,950.51530876044205,930.53747718590682]
[{"$f":"IF(E52=\"\",\"\",IF(E52=0,\"\",\"*\"))","v":"*"},"A",null,{"$f":"IF(F52=\"Chaves\",((1+$I$9)^(1/12)-1),IF(F52=\"Anual\",$I$9,IF(F52=\"Semestral\",((1+$I$9)^(1/2)-1),IF(F52=\"Mensal\",((1+$I$9)^(1/12)-1),IF(F52=\"Sinal\",0)))))","v":6.1677999999999997E-2},{"$f":"'Simulador CEF'!E88:F88","v":2},"Anual","Corrigida",{"$f":"'Simulador CEF'!M88","v":"2022-12-01"},{"$f":"'Simulador CEF'!G88","v":2000},4000,2000,4000,3603.8523674506528,null,null,2011.0869311711901,3623.830199025188,3603.8523674506528]
[{"$f":"IF(E53=\"\",\"\",IF(E53=0,\"\",\"*\"))","v":"*"},"B",null,{"$f":"IF(F53=\"Chaves\",((1+$I$9)^(1/12)-1),IF(F53=\"Anual\",$I$9,IF(F53=\"Semestral\",((1+$I$9)^(1/2)-1),IF(F53=\"Mensal\",((1+$I$9)^(1/12)-1),IF(F53=\"Sinal\",0)))))","v":5.0000148409872214E-3},{"$f":"'Simulador CEF'!E90:F90","v":12},"Mensal","Corrigida",{"$f":"'Simulador CEF'!M90","v":"2024-11-01"},{"$f":"'Simulador CEF'!G90","v":0},{"$f":"I53*E53","v":0},0,{"$f":"K53*E53","v":0},0,null,null,17.373944853283145,19.97783157453523,0]
[{"$f":"IF(E54=\"\",\"\",IF(E54=0,\"\",\"*\"))","v":"*"},"A",null,{"$f":"IF(F54=\"Chaves\",((1+$I$9)^(1/12)-1),IF(F54=\"Anual\",$I$9,IF(F54=\"Semestral\",((1+$I$9)^(1/2)-1),IF(F54=\"Mensal\",((1+$I$9)^(1/12)-1),IF(F54=\"Sinal\",0)))))","v":5.0000148409872214E-3},1,"Chaves","Corrigida",{"$f":"H25","v":"2021-12-01"},{"$f":"'Simulador CEF'!P94","v":22011},{"$f":"I54*E54","v":22011},22011,{"$f":"K54*E54","v":22011},21684.10838053067,null,null,22031.279000781138,21704.086212105205,21684.10838053067]
["*","A",null,5.0000148409872214E-3,1,"Chaves","Corrigida",{"$f":"H25","v":"2021-12-01"},{"$f":"'Simulador CEF'!P95","v":117750},117750,117750,117750,116001.26126970543,null,null,117770.27900078113,116021.23910127996]
["","A",null,false,null,null,null,null,null,{"$f":"I56*E56","v":0},0,{"$f":"K56*E56","v":0},0,null,null,null,null,{"$f":"M56","v":0}]
["","A",null,false,null,null,null,null,null,0,0,0,0,null,null,null,null,0]
["","A",null,false,null,null,null,null,null,0,0,0,0,null,null,null,null,0]
["","A",null,false,null,null,null,null,null,0,0,0,0,null,null,null,null,0]
["","A",null,false,null,null,null,null,null,0,0,0,0,null,null,null,null,0]
["","A",null,false,null,null,null,null,null,0,0,0,0,null,null,null,null,0]
["","A",null,false,null,null,null,null,null,0,0,0,0,null,null,null,null,0]
["","A",null,false,null,null,null,null,null,0,0,0,0,null,null,null,null,0]
["","A",null,false,null,null,null,null,null,0,0,0,0,null,null,null,null,0]
["","A",null,false,null,null,null,null,null,null,null,null,null,null,null,null,null,0]
[{"$f":"IF(E66=\"\",\"\",\"*\")","v":"*"},null,null,null,"TOTAL",null,null,null,null,{"$f":"SUM(J43:J65)","v":160431},null,{"$f":"SUM(L43:L65)","v":160431},{"$f":"SUM(M43:M65)","v":157259.37430325744},null,null,null,null,{"$f":"SUM(R43:R65)","v":41258.113033552028}]
["*",null,null,null,null,null,null,null,null,null,null,null,null,null,null,null,{"$f":"IF(E55<1,0,IF(H55<=$E$86,-FV(((1+$I$9)^(1/12)-1),( VLOOKUP(H55,Mês,2) ),,(-PMT((IF(F55=\"Anual\",$I$9,IF(F55=\"Semestral\",((1+$I$9)^(1/2)-1),((1+$I$9)^(1/12)-1)))),E55,R67,,1)),1),-PV(((1+$I$9)^(1/12)-1),( VLOOKUP($E$86,Mês,2) ),,R67,1)))","v":117770.27900078111},{"$f":"M38-R66","v":116021.23910127995}]
["*"]
["*"]
["*",null,null,null,null,null,"Comissão",null,"Prêmio",null,null,"Total"]
["*",null,null,null,null,null,"Valor","%","Valor","Valor do %","%","Valor","%"]
["*",null,null,null,"Corretor",null,{"$f":"H72/100*$J$66","v":0},0,null,{"$f":"K72/100*$J$66","v":0},null,{"$f":"J72+I72+G72","v":0},{"$f":"IF(L72=0,0,L72/$J$66)*100","v":0}]
["*",null,null,null,"Gerente",null,{"$f":"H73/100*$J$66","v":0},null,null,{"$f":"K73/100*$J$66","v":0},null,{"$f":"J73+I73+G73","v":0},{"$f":"IF(L73=0,0,L73/$J$66)*100","v":0}]
["*",null,null,null,{"$f":"J8","v":"Empresa de vendas"},null,{"$f":"H74/100*$J$66","v":0},null,null,{"$f":"K74/100*$J$66","v":0},null,{"$f":"J74+I74+G74","v":0},{"$f":"IF(L74=0,0,L74/$J$66)*100","v":0}]
["*",null,null,null,"TOTAL",null,{"$f":"SUM(G72:G74)","v":0},0,0,0,0,0,0]
["*"]
["*"]
["*",null,null,null,"Vistos"]
["*",null,null,null,"Serasa",null,null,"Crédito",null,null,"Diretoria"]
["*"]
["*"]
["*"]
["*"]
["*"]
["*",null,null,null,"Data das Chaves",null,null,"Perc. Pagas até Chaves TB com TP",null,null,"Perc. Pagas até Chaves TB com TP"]
["*",null,null,null,{"$f":"G11","v":"2024-01-10"},null,null,"Valor Total",null,{"$f":"SUMIF(B16:B38,\"A\",J16:J38)","v":160140},"Valor Total",null,{"$f":"SUMIF(B43:B66,\"A\",J43:J66)","v":160431}]
["*",null,null,null,null,null,null,"Preço Total",null,{"$f":"L38","v":160140},"Preço Total",null,{"$f":"L66","v":160431}]
["*",null,null,null,null,null,null,"Porcentagem",null,{"$f":"J86/J87","v":1},"Porcentagem",null,{"$f":"IF(M86=0,0,M86/M87)","v":1}]
["*"]
["*",null,null,null,"Perc. Do Sinal sobre o Total (TB)",null,null,null,{"$f":"SUMIF(F16:F38,\"Sinal\",J16:J38)/J38","v":1.3750000000000002E-2},"Perc. do Sinal sobre o Total (Proposta)",null,null,{"$f":"IF(J66=0,0,SUMIF(F43:F65,\"Sinal\",J43:J65)/J66)","v":1.8699627877405239E-2}]
["*"]
["*",null,null,null,"V.P. da Tabela",null,{"$f":"M38","v":157279.35213483198},null,"V.P. da Proposta",{"$f":"M66","v":157259.37430325744},"Diferença",{"$f":"G92-J92","v":19.97783157453523},{"$f":"L92/G92","v":1.270213241812485E-4}]

{"sheet":"Premissas e Calculos","index":2,"n_rows":64,"n_cols":23,"rows_kept":64,"cut":false,"hidden":true,"merged":[[1,18,1,19],[32,14,32,17],[17,11,17,12],[2,21,2,22],[3,9,4,9],[6,9,7,9],[24,5,26,5],[1,1,1,2],[7,15,8,16],[2,15,2,16],[1,11,1,16],[14,9,15,9],[9,11,9,13],[24,6,26,6]]}
[null,null,null,null,null,null,null,null,null,"RESPOSTAS"]
[null,"Renda Familiar",null,"Juros Nominal (a.a.)",null,"PREMISSAS","SP, Campinas, DF, RJ e RM","Capitais e acima de 500mil",null,"Valor Maximo do Imóvel no pacote",null,"Valores Financiáveis",null,null,null,null,null,null,"Select de Financiamento"]
[null,null,0.01,0.05,null,"Valor Máximo do Imóvel",240000,240000,null,240000,null,"360 meses","300 meses","240 meses",{"$f":"'Simulador CEF'!G28","v":360},"observação",null,null,null,null,null,"Resposta do simulador"]
[null,null,0.01,0.05,null,"Subsídio Máximo",27420,27420,null,"Salário do Cliente",null,{"$f":"(#REF!-#REF!)*M9","v":{"$error":"#REF!"}},{"$f":"(#REF!-#REF!)*M9","v":{"$error":"#REF!"}},{"$f":"(#REF!-#REF!)*N9","v":{"$error":"#REF!"}},{"$f":"IF(J11-J13>(G29*J11),J13*O9,J11*(1-G29)*O9)","v":121263.912},"valor maximo financiado",null,null,240,null,null,"FGTS Há mais de 3 anos?",{"$f":"IF('Simulador CEF'!S20<>0,1,0)","v":1}]
[null,null,1100,0.05,null,"Formula A Subsídio",{"$f":"-G6/(2*(3275-1800))","v":1.1438092502154554E-2},null,null,null,null,{"$f":"#REF!-'Simulador CEF'!S20-'Premissas e Calculos'!G17-#REF!","v":{"$error":"#REF!"}},{"$f":"#REF!-'Simulador CEF'!S20-'Premissas e Calculos'!G17-#REF!","v":{"$error":"#REF!"}},{"$f":"#REF!-'Simulador CEF'!S20-'Premissas e Calculos'!G17-#REF!","v":{"$error":"#REF!"}},{"$f":"IF(J11-J13>(G29*J11),J13-J21-'Premissas e Calculos'!J17,J11-J21-'Premissas e Calculos'!J17-G29*J11)","v":129568.89},"Avalição CAIXA - sub - fgts",null,null,300]
[null,null,1200,0.05,null,"Formula B Subsídio",{"$f":"(2*SUB*(2535/SUB-1)/(3275-1800))","v":-33.742372881355934},null,null,{"$f":"'Simulador CEF'!F20","v":2150},null,{"$f":"IF(#REF!=\"\",\"\",((#REF!)/((1/#REF!)+('Premissas e Calculos'!J9/12))))","v":{"$error":"#REF!"}},{"$f":"(($M$17)/((1/M8)+('Premissas e Calculos'!J9/12)))","v":84280.674245393966},{"$f":"((M17)/((1/N8)+('Premissas e Calculos'!J9/12)))","v":75852.606820854562},{"$f":"IF(P15=1,((M17)/((1/J19)+('Premissas e Calculos'!J9/12))),M17*(((J9/12)+1)^J19-1)/((J9/12)*(1+(J9/12))^J19))","v":117749.55213124157},"financiamento maximo pela renda",null,null,{"$f":"IF('Premissas e Calculos'!J6<=2790,\"\",360)","v":""}]
[null,null,1300,0.05,null,"Escala de subsídio por R$",null,null,null,"Taxa do Cliente",null,{"$f":"#REF!*(1-#REF!)","v":{"$error":"#REF!"}},{"$f":"#REF!*(1-#REF!)","v":{"$error":"#REF!"}},{"$f":"#REF!*(1-#REF!)","v":{"$error":"#REF!"}},{"$f":"J11*(1-G29)","v":151579.88999999998},"Valor máximo financiado sem comissão",null,null,"Correção da Resposta","Resposta"]
[null,"3SM",1395,0.05,null,"Início da 2a escala de subsídio",null,null,null,null,null,360,300,240,{"$f":"J19","v":360},"Quota de Financiamento maxima",null,null,{"$f":"IF(AND('Premissas e Calculos'!J6<=G14,T8=3),2,T8)","v":2},3]
[null,null,1395.01,0.05,null," Escala 2 de subsídio por SM",null,null,null,{"$f":"IF(J11<J3/(1-G29),(IF('Premissas e Calculos'!W4=1,VLOOKUP('Premissas e Calculos'!J6,'Premissas e Calculos'!C4:D64,2,TRUE)-0.5%,VLOOKUP('Premissas e Calculos'!J6,'Premissas e Calculos'!C4:D64,2,TRUE))),10.4815%)","v":0.05},null,{"$f":"IF(P15=1,80%,80%)","v":0.8},{"$f":"IF(P15=1,80%,80%)","v":0.8},{"$f":"IF(P15=1,80%,80%)","v":0.8},{"$f":"IF(O3<=240,N9,IF(O3<=300,M9,L9))","v":0.8}]
[null,null,1500,0.05,null," Escala 2 de subsídio por R$",null,null,null,"Preço de Venda",null,null,null,null,{"$f":"SMALL(O4:O7,1)","v":117749.55213124157},null,null,null,{"$f":"#REF!+#REF!+G17+'Simulador CEF'!S20=#REF!","v":{"$error":"#REF!"}},{"$f":"#REF!=#REF!+#REF!+'Simulador CEF'!S20+G17","v":{"$error":"#REF!"}}]
[null,null,1600,0.05,null,"Comissão",3.5000000000000003E-2,{"$f":"G11","v":3.5000000000000003E-2},null,{"$f":"'Simulador CEF'!V6","v":159390}]
[null,null,1700,0.05,null,"Comprometimento de Renda",0.3,{"$f":"G12","v":0.3},null,"Avaliação CAIXA"]
[null,null,1800,0.05,null,"Salário Mínimo",937,{"$f":"SM","v":937},null,{"$f":"VLOOKUP('Simulador CEF'!I6,Apoio!C9:E30,3,FALSE)","v":158000},null,null,null,null,"Prazo Máximo a financiar",{"$f":"O4*G32","v":121263.912}]
[null,"4SM",1860,0.05,null,"Valor Máximo financiado em 300 meses",{"$f":"6*G13","v":5622},{"$f":"G14","v":5622},null,null,null,null,null,null,360,{"$f":"125*0.96*0.96","v":115.19999999999999}]
[null,null,2000,0.05,"pcva1","INCC (a.a.) Nominal",0.06,{"$f":"INCC","v":0.06},null,"Subsísidio praticado",null,null,null,null,"Prazo Máx. Financ.",{"$f":"'Simulador CEF'!Z20","v":0}]
[null,null,2000,5.2499999999999998E-2,null,"Obra / VGV",0.8,{"$f":"OBRA_VGV","v":0.8},null,null,null,"Parcela Máxima","Parcela Máxima sem taxa",null,420]
[null,null,2100,5.5E-2,null,"Subsídio",{"$f":"IF('Simulador CEF'!$D$22=2,ROUNDDOWN(IF($J$6<=1800,SUB,IF($J$6>=4000.01,0,IF($J$6>=3284,2535,IF($J$6>=1800.01,$G$5*($J$6-1800)*($J$6-1800)+$G$6*($J$6-1800)+SUB)))),0),ROUNDDOWN(IF($J$6<=1800,(SUB/2),IF($J$6>=4000.01,0,IF($J$6>=3284,(2535/2),IF($J$6>=1800.01,(($G$5*($J$6-1800)*($J$6-1800)+$G$6*($J$6-1800)+(SUB))/2))))),0))","v":17011},{"$f":"G17","v":17011},null,{"$f":"IF('Simulador CEF'!E32=\"sim\",IF(AND(J11*(1-G29)<=J3,J13<=J3),IF(J3=VMI,G17,H17),0),0)","v":17011},null,{"$f":"((J6*'Premissas e Calculos'!G12)-IF(J6>2790,H19,0))/(1+Q32)","v":632.10505684045472},{"$f":"IF(J6<='Premissas e Calculos'!G20,'Premissas e Calculos'!L17,'Premissas e Calculos'!L17-'Premissas e Calculos'!G19)","v":632.10505684045472}]
[null,"5SM",2200,5.5E-2,null,null,null,null,null,"Prazo",null,"Análise de Crédito"]
[null,null,2350,5.5E-2,null,"Taxa de Administração",21.66,{"$f":"G19","v":21.66},null,{"$f":"O3","v":360},null,{"$f":"J6*0.9*G12","v":580.5},{"$f":"IF(J6<='Premissas e Calculos'!G20,'Premissas e Calculos'!L19,'Premissas e Calculos'!L19-'Premissas e Calculos'!G19)+J33*70%/12","v":580.5}]
[null,null,2350.0100000000002,5.5E-2,null,"Salário Isento de Taxa",{"$f":"G14","v":5622},{"$f":"G20","v":5622},null,"FGTS"]
[null,null,2455,5.5E-2,null,null,null,null,null,{"$f":"'Simulador CEF'!S20","v":5000}]
[null,null,2455.0100000000002,5.5E-2,null,null,null,null,null,null,null,null,null,null,"Idade","Seguro Morte ou Invalidez","Fundo Garantidor (emprego)","Total"]
[null,null,2600,5.5E-2,null,null,null,null,null,null,null,null,null,null,0,1.5,0.5,{"$f":"Q23+P23","v":2}]
[null,"6SM",2650,0.06,null,null,null,null,null,"Valor Máximo do FGTS",null,null,null,null,{"$f":"25 + 1/10^6","v":25.000001000000001},1.54,0.5,{"$f":"Q24+P24","v":2.04}]
[null,null,2700.01,0.06,null,"ENTRADA MÍNIMA",0,null,null,{"$f":"MINA(J11*(1-G25)-J17,J13)","v":142379},null,null,null,null,{"$f":"30+ 1/10^6","v":30.000001000000001},1.64,0.5,2.1399999999999997]
[null,null,2790.01,0.06,null,null,null,null,null,null,null,null,null,null,{"$f":"35+ 1/10^6","v":35.000000999999997},1.82,0.5,2.3200000000000003]
[null,null,2900,0.06,null,null,null,null,null,"Prazo Obra",null,null,null,null,{"$f":"40+ 1/10^6","v":40.000000999999997},2.59,0.5,3.09]
[null,null,3000,0.06,null,null,null,null,null,{"$f":"Apoio!I35","v":31},null,null,null,null,{"$f":"45+ 1/10^6","v":45.000000999999997},3.02,0.5,3.52]
[null,null,3000.01,0.06,null,"Comissão",4.9000000000000002E-2,null,null,"Repasse",null,null,"Empresas de Vendas",null,{"$f":"50+ 1/10^6","v":50.000000999999997},6.64,0.5,7.14]
[null,"7SM",3001,7.0000000000000007E-2,null,null,null,null,null,{"$f":"VLOOKUP('Simulador CEF'!I6,Apoio!C9:F30,4,FALSE)","v":3},null,null,"MAIS"]
[null,null,3275,7.0000000000000007E-2,null,null,null,null,null,null,null,null,"CURY VENDAS",null,"Idade (meses)","Idade Repasse (anos)","Taxa (%)","Taxa (R$)"]
[null,null,3275.01,7.0000000000000007E-2,null,"Limite máximo de financiamento (REPASSE)",{"$f":"IF(P15=1,100%,100%)","v":1},null,null,"CLT",null,null,"CURY & CIA",null,{"$f":"'Simulador CEF'!IV92","v":336},{"$f":"(O32+J30+2)/12","v":28.416666666666668},{"$f":"VLOOKUP(P32,O23:R29,4,TRUE)/100","v":2.0400000000000001E-2},{"$f":"(J6*'Premissas e Calculos'!G12)*Q32","v":13.158000000000001}]
[null,null,3500,7.0000000000000007E-2,null,null,null,null,null,null,null,null,"VENDA INTERNA",null,"O Cálculo da Taxa leva em conta a idade do cliente no repasse e não na data da venda (incluindo margem de segurança de 2 meses). No Simulador da CAIXA não desconta a taxa do Fundo, pois é optativo, mas na prática todos optam. "]
[null,"8SM",3600,7.0000000000000007E-2]
[null,null,3600.01,7.0000000000000007E-2,null,"Chaves (valor máximo da poupança)",0.3]
[null,null,3800,7.0000000000000007E-2]
[null,null,3900,7.0000000000000007E-2]
[null,null,4000,7.0000000000000007E-2,null,"Data de Mudança de Tabela","2021-09-30"]
[null,"9SM",4000.01,7.0000000000000007E-2,"pcva2"]
[null,null,4185,8.1600000000000006E-2]
[null,null,4300,8.1600000000000006E-2]
[null,null,4400,8.1600000000000006E-2]
[null,null,4500,8.1600000000000006E-2]
[null,"10SM",4600,8.1600000000000006E-2]
[null,null,6500,8.1600000000000006E-2]
[null,null,6500.01,8.1600000000000006E-2]
[null,null,6600,8.1600000000000006E-2]
[null,null,6700,8.1600000000000006E-2]
[null,null,6800,8.1600000000000006E-2]
[null,null,6900,8.1600000000000006E-2]
[null,null,7000,8.1600000000000006E-2]
[null,null,7001,9.1600000000000001E-2]
[null,null,7600,9.1600000000000001E-2]
[null,null,7700,9.1600000000000001E-2]
[null,null,7800,9.1600000000000001E-2]
[null,null,7900,9.1600000000000001E-2]
[null,null,8000,9.1600000000000001E-2]
[null,null,8500,9.1600000000000001E-2]
[null,null,8600,9.1600000000000001E-2]
[null,null,8700,9.1600000000000001E-2]
[null,null,8800,9.1600000000000001E-2]
[null,null,8900,9.1600000000000001E-2]
[null,null,9000,9.1600000000000001E-2]
[null,null,9000,0.10249999999999999,"pcva3"]

{"sheet":"Apoio","index":3,"n_rows":76,"n_cols":10,"rows_kept":76,"cut":false,"hidden":true,"merged":[[31,1,31,4],[0,1,0,4],[2,3,2,4],[5,1,7,1],[4,1,4,4]]}
[null,"Planilha de resposta do empreendimento escolhido"]
[null,"Código Empreendimento",null,{"$f":"VLOOKUP('Simulador CEF'!G4,'DADOS DOS EMPREENDIMENTOS'!B10:C28,2,FALSE)","v":2}]
[null,"Empreendimento:",null,{"$f":"VLOOKUP(D2,'DADOS DOS EMPREENDIMENTOS'!A10:B28,2,FALSE)","v":"Completo Guanabara - Desconto - Sem Premio"}]
[null,"Valor Máximo Do Imóvel dentro do Pacote",null,null,{"$f":"VLOOKUP(D2,'DADOS DOS EMPREENDIMENTOS'!A10:I27,9,FALSE)","v":190000}]
[null,"Tabela de Unidades disponíveis"]
[null,null,"Código Tipo","Código Venda","Código Avaliação"]
[null,null,{"$f":"VLOOKUP($D$2,'DADOS DOS EMPREENDIMENTOS'!$C$10:$H$28,4,FALSE)","v":7},{"$f":"VLOOKUP($D$2,'DADOS DOS EMPREENDIMENTOS'!$C$10:$H$28,5,FALSE)","v":8},{"$f":"VLOOKUP($D$2,'DADOS DOS EMPREENDIMENTOS'!$C$10:$H$28,6,FALSE)","v":9},{"$f":"VLOOKUP($D$2,'DADOS DOS EMPREENDIMENTOS'!$C$10:$N$28,12,FALSE)","v":10}]
[null,null,"Tipo","Preço de Venda","Avaliação CAIXA","Repasse"]
[null,1,{"$f":"VLOOKUP(B9,'DADOS DOS EMPREENDIMENTOS'!$O$16:$CX$42,Apoio!$C$7,FALSE)","v":"5° andar S/ Vaga"},{"$f":"VLOOKUP(B9,'DADOS DOS EMPREENDIMENTOS'!$O$16:$CX$42,Apoio!$D$7,FALSE)","v":157390},{"$f":"VLOOKUP(B9,'DADOS DOS EMPREENDIMENTOS'!$O$16:$CX$42,Apoio!$E$7,FALSE)","v":158000},{"$f":"VLOOKUP(B9,'DADOS DOS EMPREENDIMENTOS'!$O$16:$CX$42,Apoio!$F$7,FALSE)","v":3}]
[null,2,{"$f":"VLOOKUP(B10,'DADOS DOS EMPREENDIMENTOS'!$O$16:$CX$42,Apoio!$C$7,FALSE)","v":"4° andar S/ Vaga"},{"$f":"VLOOKUP(B10,'DADOS DOS EMPREENDIMENTOS'!$O$16:$CX$42,Apoio!$D$7,FALSE)","v":159390},{"$f":"VLOOKUP(B10,'DADOS DOS EMPREENDIMENTOS'!$O$16:$CX$42,Apoio!$E$7,FALSE)","v":158000},{"$f":"VLOOKUP(B10,'DADOS DOS EMPREENDIMENTOS'!$O$16:$CX$42,Apoio!$F$7,FALSE)","v":3}]
[null,3,{"$f":"VLOOKUP(B11,'DADOS DOS EMPREENDIMENTOS'!$O$16:$CX$42,Apoio!$C$7,FALSE)","v":"4° andar C/ Vaga"},{"$f":"VLOOKUP(B11,'DADOS DOS EMPREENDIMENTOS'!$O$16:$CX$42,Apoio!$D$7,FALSE)","v":173390},{"$f":"VLOOKUP(B11,'DADOS DOS EMPREENDIMENTOS'!$O$16:$CX$42,Apoio!$E$7,FALSE)","v":172000},{"$f":"VLOOKUP(B11,'DADOS DOS EMPREENDIMENTOS'!$O$16:$CX$42,Apoio!$F$7,FALSE)","v":3}]
[null,4,{"$f":"VLOOKUP(B12,'DADOS DOS EMPREENDIMENTOS'!$O$16:$CX$42,Apoio!$C$7,FALSE)","v":"3°andar C/ Vaga"},{"$f":"VLOOKUP(B12,'DADOS DOS EMPREENDIMENTOS'!$O$16:$CX$42,Apoio!$D$7,FALSE)","v":173390},{"$f":"VLOOKUP(B12,'DADOS DOS EMPREENDIMENTOS'!$O$16:$CX$42,Apoio!$E$7,FALSE)","v":178000},{"$f":"VLOOKUP(B12,'DADOS DOS EMPREENDIMENTOS'!$O$16:$CX$42,Apoio!$F$7,FALSE)","v":3}]
[null,5,{"$f":"VLOOKUP(B13,'DADOS DOS EMPREENDIMENTOS'!$O$16:$CX$42,Apoio!$C$7,FALSE)","v":"2°andar C/ Vaga"},{"$f":"VLOOKUP(B13,'DADOS DOS EMPREENDIMENTOS'!$O$16:$CX$42,Apoio!$D$7,FALSE)","v":174390},{"$f":"VLOOKUP(B13,'DADOS DOS EMPREENDIMENTOS'!$O$16:$CX$42,Apoio!$E$7,FALSE)","v":178000},{"$f":"VLOOKUP(B13,'DADOS DOS EMPREENDIMENTOS'!$O$16:$CX$42,Apoio!$F$7,FALSE)","v":3}]
[null,6,{"$f":"VLOOKUP(B14,'DADOS DOS EMPREENDIMENTOS'!$O$16:$CX$42,Apoio!$C$7,FALSE)","v":"1° andar S/ Vaga"},{"$f":"VLOOKUP(B14,'DADOS DOS EMPREENDIMENTOS'!$O$16:$CX$42,Apoio!$D$7,FALSE)","v":158390},{"$f":"VLOOKUP(B14,'DADOS DOS EMPREENDIMENTOS'!$O$16:$CX$42,Apoio!$E$7,FALSE)","v":151000},{"$f":"VLOOKUP(B14,'DADOS DOS EMPREENDIMENTOS'!$O$16:$CX$42,Apoio!$F$7,FALSE)","v":1}]
[null,7,{"$f":"VLOOKUP(B15,'DADOS DOS EMPREENDIMENTOS'!$O$16:$CX$42,Apoio!$C$7,FALSE)","v":"1° andar C/ Vaga"},{"$f":"VLOOKUP(B15,'DADOS DOS EMPREENDIMENTOS'!$O$16:$CX$42,Apoio!$D$7,FALSE)","v":172390},{"$f":"VLOOKUP(B15,'DADOS DOS EMPREENDIMENTOS'!$O$16:$CX$42,Apoio!$E$7,FALSE)","v":179000},{"$f":"VLOOKUP(B15,'DADOS DOS EMPREENDIMENTOS'!$O$16:$CX$42,Apoio!$F$7,FALSE)","v":3}]
[null,8,{"$f":"VLOOKUP(B16,'DADOS DOS EMPREENDIMENTOS'!$O$16:$CX$42,Apoio!$C$7,FALSE)","v":"1º andar 1 Quarto (PNE)"},{"$f":"VLOOKUP(B16,'DADOS DOS EMPREENDIMENTOS'!$O$16:$CX$42,Apoio!$D$7,FALSE)","v":162390},{"$f":"VLOOKUP(B16,'DADOS DOS EMPREENDIMENTOS'!$O$16:$CX$42,Apoio!$E$7,FALSE)","v":171000},{"$f":"VLOOKUP(B16,'DADOS DOS EMPREENDIMENTOS'!$O$16:$CX$42,Apoio!$F$7,FALSE)","v":3}]
[null,9,{"$f":"VLOOKUP(B17,'DADOS DOS EMPREENDIMENTOS'!$O$16:$CX$42,Apoio!$C$7,FALSE)","v":0},{"$f":"VLOOKUP(B17,'DADOS DOS EMPREENDIMENTOS'!$O$16:$CX$42,Apoio!$D$7,FALSE)","v":0},{"$f":"VLOOKUP(B17,'DADOS DOS EMPREENDIMENTOS'!$O$16:$CX$42,Apoio!$E$7,FALSE)","v":0},{"$f":"VLOOKUP(B17,'DADOS DOS EMPREENDIMENTOS'!$O$16:$CX$42,Apoio!$F$7,FALSE)","v":0}]
[null,10,{"$f":"VLOOKUP(B18,'DADOS DOS EMPREENDIMENTOS'!$O$16:$CX$42,Apoio!$C$7,FALSE)","v":0},{"$f":"VLOOKUP(B18,'DADOS DOS EMPREENDIMENTOS'!$O$16:$CX$42,Apoio!$D$7,FALSE)","v":0},{"$f":"VLOOKUP(B18,'DADOS DOS EMPREENDIMENTOS'!$O$16:$CX$42,Apoio!$E$7,FALSE)","v":0},{"$f":"VLOOKUP(B18,'DADOS DOS EMPREENDIMENTOS'!$O$16:$CX$42,Apoio!$F$7,FALSE)","v":0}]
[null,11,{"$f":"VLOOKUP(B19,'DADOS DOS EMPREENDIMENTOS'!$O$16:$CX$42,Apoio!$C$7,FALSE)","v":0},{"$f":"VLOOKUP(B19,'DADOS DOS EMPREENDIMENTOS'!$O$16:$CX$42,Apoio!$D$7,FALSE)","v":0},{"$f":"VLOOKUP(B19,'DADOS DOS EMPREENDIMENTOS'!$O$16:$CX$42,Apoio!$E$7,FALSE)","v":0},{"$f":"VLOOKUP(B19,'DADOS DOS EMPREENDIMENTOS'!$O$16:$CX$42,Apoio!$F$7,FALSE)","v":0}]
[null,12,{"$f":"VLOOKUP(B20,'DADOS DOS EMPREENDIMENTOS'!$O$16:$CX$42,Apoio!$C$7,FALSE)","v":0},{"$f":"VLOOKUP(B20,'DADOS DOS EMPREENDIMENTOS'!$O$16:$CX$42,Apoio!$D$7,FALSE)","v":0},{"$f":"VLOOKUP(B20,'DADOS DOS EMPREENDIMENTOS'!$O$16:$CX$42,Apoio!$E$7,FALSE)","v":0},{"$f":"VLOOKUP(B20,'DADOS DOS EMPREENDIMENTOS'!$O$16:$CX$42,Apoio!$F$7,FALSE)","v":0}]
[null,13,{"$f":"VLOOKUP(B21,'DADOS DOS EMPREENDIMENTOS'!$O$16:$CX$42,Apoio!$C$7,FALSE)","v":{"$error":"#N/A"}},{"$f":"VLOOKUP(B21,'DADOS DOS EMPREENDIMENTOS'!$O$16:$CX$42,Apoio!$D$7,FALSE)","v":{"$error":"#N/A"}},{"$f":"VLOOKUP(B21,'DADOS DOS EMPREENDIMENTOS'!$O$16:$CX$42,Apoio!$E$7,FALSE)","v":{"$error":"#N/A"}},{"$f":"VLOOKUP(B21,'DADOS DOS EMPREENDIMENTOS'!$O$16:$CX$42,Apoio!$F$7,FALSE)","v":{"$error":"#N/A"}}]
[null,14,{"$f":"VLOOKUP(B22,'DADOS DOS EMPREENDIMENTOS'!$O$16:$CX$42,Apoio!$C$7,FALSE)","v":{"$error":"#N/A"}},{"$f":"VLOOKUP(B22,'DADOS DOS EMPREENDIMENTOS'!$O$16:$CX$42,Apoio!$D$7,FALSE)","v":{"$error":"#N/A"}},{"$f":"VLOOKUP(B22,'DADOS DOS EMPREENDIMENTOS'!$O$16:$CX$42,Apoio!$E$7,FALSE)","v":{"$error":"#N/A"}},{"$f":"VLOOKUP(B22,'DADOS DOS EMPREENDIMENTOS'!$O$16:$CX$42,Apoio!$F$7,FALSE)","v":{"$error":"#N/A"}}]
[null,15,{"$f":"VLOOKUP(B23,'DADOS DOS EMPREENDIMENTOS'!$O$16:$CX$42,Apoio!$C$7,FALSE)","v":{"$error":"#N/A"}},{"$f":"VLOOKUP(B23,'DADOS DOS EMPREENDIMENTOS'!$O$16:$CX$42,Apoio!$D$7,FALSE)","v":{"$error":"#N/A"}},{"$f":"VLOOKUP(B23,'DADOS DOS EMPREENDIMENTOS'!$O$16:$CX$42,Apoio!$E$7,FALSE)","v":{"$error":"#N/A"}},{"$f":"VLOOKUP(B23,'DADOS DOS EMPREENDIMENTOS'!$O$16:$CX$42,Apoio!$F$7,FALSE)","v":{"$error":"#N/A"}}]
[null,16,{"$f":"VLOOKUP(B24,'DADOS DOS EMPREENDIMENTOS'!$O$16:$CX$42,Apoio!$C$7,FALSE)","v":{"$error":"#N/A"}},{"$f":"VLOOKUP(B24,'DADOS DOS EMPREENDIMENTOS'!$O$16:$CX$42,Apoio!$D$7,FALSE)","v":{"$error":"#N/A"}},{"$f":"VLOOKUP(B24,'DADOS DOS EMPREENDIMENTOS'!$O$16:$CX$42,Apoio!$E$7,FALSE)","v":{"$error":"#N/A"}},{"$f":"VLOOKUP(B24,'DADOS DOS EMPREENDIMENTOS'!$O$16:$CX$42,Apoio!$F$7,FALSE)","v":{"$error":"#N/A"}}]
[null,17,{"$f":"VLOOKUP(B25,'DADOS DOS EMPREENDIMENTOS'!$O$16:$CX$42,Apoio!$C$7,FALSE)","v":{"$error":"#N/A"}},{"$f":"VLOOKUP(B25,'DADOS DOS EMPREENDIMENTOS'!$O$16:$CX$42,Apoio!$D$7,FALSE)","v":{"$error":"#N/A"}},{"$f":"VLOOKUP(B25,'DADOS DOS EMPREENDIMENTOS'!$O$16:$CX$42,Apoio!$E$7,FALSE)","v":{"$error":"#N/A"}},{"$f":"VLOOKUP(B25,'DADOS DOS EMPREENDIMENTOS'!$O$16:$CX$42,Apoio!$F$7,FALSE)","v":{"$error":"#N/A"}}]
[null,18,{"$f":"VLOOKUP(B26,'DADOS DOS EMPREENDIMENTOS'!$O$16:$CX$42,Apoio!$C$7,FALSE)","v":{"$error":"#N/A"}},{"$f":"VLOOKUP(B26,'DADOS DOS EMPREENDIMENTOS'!$O$16:$CX$42,Apoio!$D$7,FALSE)","v":{"$error":"#N/A"}},{"$f":"VLOOKUP(B26,'DADOS DOS EMPREENDIMENTOS'!$O$16:$CX$42,Apoio!$E$7,FALSE)","v":{"$error":"#N/A"}},{"$f":"VLOOKUP(B26,'DADOS DOS EMPREENDIMENTOS'!$O$16:$CX$42,Apoio!$F$7,FALSE)","v":{"$error":"#N/A"}}]
[null,19,{"$f":"VLOOKUP(B27,'DADOS DOS EMPREENDIMENTOS'!$O$16:$CX$42,Apoio!$C$7,FALSE)","v":{"$error":"#N/A"}},{"$f":"VLOOKUP(B27,'DADOS DOS EMPREENDIMENTOS'!$O$16:$CX$42,Apoio!$D$7,FALSE)","v":{"$error":"#N/A"}},{"$f":"VLOOKUP(B27,'DADOS DOS EMPREENDIMENTOS'!$O$16:$CX$42,Apoio!$E$7,FALSE)","v":{"$error":"#N/A"}},{"$f":"VLOOKUP(B27,'DADOS DOS EMPREENDIMENTOS'!$O$16:$CX$42,Apoio!$F$7,FALSE)","v":{"$error":"#N/A"}}]
[null,20,{"$f":"VLOOKUP(B28,'DADOS DOS EMPREENDIMENTOS'!$O$16:$CX$42,Apoio!$C$7,FALSE)","v":{"$error":"#N/A"}},{"$f":"VLOOKUP(B28,'DADOS DOS EMPREENDIMENTOS'!$O$16:$CX$42,Apoio!$D$7,FALSE)","v":{"$error":"#N/A"}},{"$f":"VLOOKUP(B28,'DADOS DOS EMPREENDIMENTOS'!$O$16:$CX$42,Apoio!$E$7,FALSE)","v":{"$error":"#N/A"}},{"$f":"VLOOKUP(B28,'DADOS DOS EMPREENDIMENTOS'!$O$16:$CX$42,Apoio!$F$7,FALSE)","v":{"$error":"#N/A"}}]
[null,21,{"$f":"VLOOKUP(B29,'DADOS DOS EMPREENDIMENTOS'!$O$16:$CX$42,Apoio!$C$7,FALSE)","v":{"$error":"#N/A"}},{"$f":"VLOOKUP(B29,'DADOS DOS EMPREENDIMENTOS'!$O$16:$CX$42,Apoio!$D$7,FALSE)","v":{"$error":"#N/A"}},{"$f":"VLOOKUP(B29,'DADOS DOS EMPREENDIMENTOS'!$O$16:$CX$42,Apoio!$E$7,FALSE)","v":{"$error":"#N/A"}},{"$f":"VLOOKUP(B29,'DADOS DOS EMPREENDIMENTOS'!$O$16:$CX$42,Apoio!$F$7,FALSE)","v":{"$error":"#N/A"}}]
[null,22,{"$f":"VLOOKUP(B30,'DADOS DOS EMPREENDIMENTOS'!$O$16:$CX$42,Apoio!$C$7,FALSE)","v":{"$error":"#N/A"}},{"$f":"VLOOKUP(B30,'DADOS DOS EMPREENDIMENTOS'!$O$16:$CX$42,Apoio!$D$7,FALSE)","v":{"$error":"#N/A"}},{"$f":"VLOOKUP(B30,'DADOS DOS EMPREENDIMENTOS'!$O$16:$CX$42,Apoio!$E$7,FALSE)","v":{"$error":"#N/A"}},{"$f":"VLOOKUP(B30,'DADOS DOS EMPREENDIMENTOS'!$O$16:$CX$42,Apoio!$F$7,FALSE)","v":{"$error":"#N/A"}}]
[]
[null,"Fluxo de Juros da CAIXA"]
[null,"Taxa de Juros",null,{"$f":"'Premissas e Calculos'!J9","v":0.05},"Código"]
[null,"Valor Financiado",null,{"$f":"'Simulador CEF'!F119","v":117750},{"$f":"VLOOKUP($D$2,'DADOS DOS EMPREENDIMENTOS'!$C$10:$D$28,2,FALSE)","v":8},"Habite-se","Repasse","Período Atual","Prazo Para o Término de Obra","término da obra"]
[null,"Período","Obra","Desembolso","Juros Cliente",{"$f":"VLOOKUP($D$2,'DADOS DOS EMPREENDIMENTOS'!A10:J28,10,FALSE)+3","v":34},{"$f":"VLOOKUP($D$2,'DADOS DOS EMPREENDIMENTOS'!A10:L28,12,FALSE)","v":0},{"$f":"VLOOKUP($D$2,'DADOS DOS EMPREENDIMENTOS'!A10:M28,13,FALSE)","v":0},{"$f":"VLOOKUP($D$2,'DADOS DOS EMPREENDIMENTOS'!A10:J28,10,FALSE)","v":31},{"$f":"VLOOKUP($D$2,'DADOS DOS EMPREENDIMENTOS'!A10:J28,10,FALSE)","v":31}]
[]
[null,1,{"$f":"VLOOKUP(B37,'DADOS DOS EMPREENDIMENTOS'!$O$47:$FW$87,Apoio!$E$34,FALSE)","v":0},{"$f":"VLOOKUP(B37,'DADOS DOS EMPREENDIMENTOS'!$O$47:$FW$87,Apoio!$E$34+1,FALSE)","v":0}]
[null,2,{"$f":"VLOOKUP(B38,'DADOS DOS EMPREENDIMENTOS'!$O$47:$FW$87,Apoio!$E$34,FALSE)","v":0},{"$f":"VLOOKUP(B38,'DADOS DOS EMPREENDIMENTOS'!$O$47:$FW$87,Apoio!$E$34+1,FALSE)","v":0},{"$f":"IF(B38>$F$35,0,SUM($D$37:D37)*Apoio!$D$33*Apoio!$D$34/12)","v":0}]
[null,3,{"$f":"VLOOKUP(B39,'DADOS DOS EMPREENDIMENTOS'!$O$47:$FW$87,Apoio!$E$34,FALSE)","v":0},{"$f":"VLOOKUP(B39,'DADOS DOS EMPREENDIMENTOS'!$O$47:$FW$87,Apoio!$E$34+1,FALSE)","v":0},{"$f":"IF(B39>$F$35,0,SUM($D$37:D38)*Apoio!$D$33*Apoio!$D$34/12)","v":0}]
[null,4,{"$f":"VLOOKUP(B40,'DADOS DOS EMPREENDIMENTOS'!$O$47:$FW$87,Apoio!$E$34,FALSE)","v":0},{"$f":"VLOOKUP(B40,'DADOS DOS EMPREENDIMENTOS'!$O$47:$FW$87,Apoio!$E$34+1,FALSE)","v":0},{"$f":"IF(B40>$F$35,0,SUM($D$37:D39)*Apoio!$D$33*Apoio!$D$34/12)","v":0}]
[null,5,{"$f":"VLOOKUP(B41,'DADOS DOS EMPREENDIMENTOS'!$O$47:$FW$87,Apoio!$E$34,FALSE)","v":0},{"$f":"VLOOKUP(B41,'DADOS DOS EMPREENDIMENTOS'!$O$47:$FW$87,Apoio!$E$34+1,FALSE)","v":0},{"$f":"IF(B41>$F$35,0,SUM($D$37:D40)*Apoio!$D$33*Apoio!$D$34/12)","v":0}]
[null,6,{"$f":"VLOOKUP(B42,'DADOS DOS EMPREENDIMENTOS'!$O$47:$FW$87,Apoio!$E$34,FALSE)","v":0},{"$f":"VLOOKUP(B42,'DADOS DOS EMPREENDIMENTOS'!$O$47:$FW$87,Apoio!$E$34+1,FALSE)","v":0},{"$f":"IF(B42>$F$35,0,SUM($D$37:D41)*Apoio!$D$33*Apoio!$D$34/12)","v":0}]
[null,7,{"$f":"VLOOKUP(B43,'DADOS DOS EMPREENDIMENTOS'!$O$47:$FW$87,Apoio!$E$34,FALSE)","v":0},{"$f":"VLOOKUP(B43,'DADOS DOS EMPREENDIMENTOS'!$O$47:$FW$87,Apoio!$E$34+1,FALSE)","v":0},{"$f":"IF(B43>$F$35,0,SUM($D$37:D42)*Apoio!$D$33*Apoio!$D$34/12)","v":0}]
[null,8,{"$f":"VLOOKUP(B44,'DADOS DOS EMPREENDIMENTOS'!$O$47:$FW$87,Apoio!$E$34,FALSE)","v":0},{"$f":"VLOOKUP(B44,'DADOS DOS EMPREENDIMENTOS'!$O$47:$FW$87,Apoio!$E$34+1,FALSE)","v":0},{"$f":"IF(B44>$F$35,0,SUM($D$37:D43)*Apoio!$D$33*Apoio!$D$34/12)","v":0}]
[null,9,{"$f":"VLOOKUP(B45,'DADOS DOS EMPREENDIMENTOS'!$O$47:$FW$87,Apoio!$E$34,FALSE)","v":0},{"$f":"VLOOKUP(B45,'DADOS DOS EMPREENDIMENTOS'!$O$47:$FW$87,Apoio!$E$34+1,FALSE)","v":0},{"$f":"IF(B45>$F$35,0,SUM($D$37:D44)*Apoio!$D$33*Apoio!$D$34/12)","v":0}]
[null,10,{"$f":"VLOOKUP(B46,'DADOS DOS EMPREENDIMENTOS'!$O$47:$FW$87,Apoio!$E$34,FALSE)","v":0},{"$f":"VLOOKUP(B46,'DADOS DOS EMPREENDIMENTOS'!$O$47:$FW$87,Apoio!$E$34+1,FALSE)","v":0},{"$f":"IF(B46>$F$35,0,SUM($D$37:D45)*Apoio!$D$33*Apoio!$D$34/12)","v":0}]
[null,11,{"$f":"VLOOKUP(B47,'DADOS DOS EMPREENDIMENTOS'!$O$47:$FW$87,Apoio!$E$34,FALSE)","v":0},{"$f":"VLOOKUP(B47,'DADOS DOS EMPREENDIMENTOS'!$O$47:$FW$87,Apoio!$E$34+1,FALSE)","v":0},{"$f":"IF(B47>$F$35,0,SUM($D$37:D46)*Apoio!$D$33*Apoio!$D$34/12)","v":0}]
[null,12,{"$f":"VLOOKUP(B48,'DADOS DOS EMPREENDIMENTOS'!$O$47:$FW$87,Apoio!$E$34,FALSE)","v":0},{"$f":"VLOOKUP(B48,'DADOS DOS EMPREENDIMENTOS'!$O$47:$FW$87,Apoio!$E$34+1,FALSE)","v":0},{"$f":"IF(B48>$F$35,0,SUM($D$37:D47)*Apoio!$D$33*Apoio!$D$34/12)","v":0}]
[null,13,{"$f":"VLOOKUP(B49,'DADOS DOS EMPREENDIMENTOS'!$O$47:$FW$87,Apoio!$E$34,FALSE)","v":0},{"$f":"VLOOKUP(B49,'DADOS DOS EMPREENDIMENTOS'!$O$47:$FW$87,Apoio!$E$34+1,FALSE)","v":0},{"$f":"IF(B49>$F$35,0,SUM($D$37:D48)*Apoio!$D$33*Apoio!$D$34/12)","v":0}]
[null,14,{"$f":"VLOOKUP(B50,'DADOS DOS EMPREENDIMENTOS'!$O$47:$FW$87,Apoio!$E$34,FALSE)","v":0},{"$f":"VLOOKUP(B50,'DADOS DOS EMPREENDIMENTOS'!$O$47:$FW$87,Apoio!$E$34+1,FALSE)","v":0},{"$f":"IF(B50>$F$35,0,SUM($D$37:D49)*Apoio!$D$33*Apoio!$D$34/12)","v":0}]
[null,15,{"$f":"VLOOKUP(B51,'DADOS DOS EMPREENDIMENTOS'!$O$47:$FW$87,Apoio!$E$34,FALSE)","v":0},{"$f":"VLOOKUP(B51,'DADOS DOS EMPREENDIMENTOS'!$O$47:$FW$87,Apoio!$E$34+1,FALSE)","v":0},{"$f":"IF(B51>$F$35,0,SUM($D$37:D50)*Apoio!$D$33*Apoio!$D$34/12)","v":0}]
[null,16,{"$f":"VLOOKUP(B52,'DADOS DOS EMPREENDIMENTOS'!$O$47:$FW$87,Apoio!$E$34,FALSE)","v":0},{"$f":"VLOOKUP(B52,'DADOS DOS EMPREENDIMENTOS'!$O$47:$FW$87,Apoio!$E$34+1,FALSE)","v":0},{"$f":"IF(B52>$F$35,0,SUM($D$37:D51)*Apoio!$D$33*Apoio!$D$34/12)","v":0}]
[null,17,{"$f":"VLOOKUP(B53,'DADOS DOS EMPREENDIMENTOS'!$O$47:$FW$87,Apoio!$E$34,FALSE)","v":0},{"$f":"VLOOKUP(B53,'DADOS DOS EMPREENDIMENTOS'!$O$47:$FW$87,Apoio!$E$34+1,FALSE)","v":0},{"$f":"IF(B53>$F$35,0,SUM($D$37:D52)*Apoio!$D$33*Apoio!$D$34/12)","v":0}]
[null,18,{"$f":"VLOOKUP(B54,'DADOS DOS EMPREENDIMENTOS'!$O$47:$FW$87,Apoio!$E$34,FALSE)","v":0},{"$f":"VLOOKUP(B54,'DADOS DOS EMPREENDIMENTOS'!$O$47:$FW$87,Apoio!$E$34+1,FALSE)","v":0},{"$f":"IF(B54>$F$35,0,SUM($D$37:D53)*Apoio!$D$33*Apoio!$D$34/12)","v":0}]
[null,19,{"$f":"VLOOKUP(B55,'DADOS DOS EMPREENDIMENTOS'!$O$47:$FW$87,Apoio!$E$34,FALSE)","v":0},{"$f":"VLOOKUP(B55,'DADOS DOS EMPREENDIMENTOS'!$O$47:$FW$87,Apoio!$E$34+1,FALSE)","v":0},{"$f":"IF(B55>$F$35,0,SUM($D$37:D54)*Apoio!$D$33*Apoio!$D$34/12)","v":0}]
[null,20,{"$f":"VLOOKUP(B56,'DADOS DOS EMPREENDIMENTOS'!$O$47:$FW$87,Apoio!$E$34,FALSE)","v":0},{"$f":"VLOOKUP(B56,'DADOS DOS EMPREENDIMENTOS'!$O$47:$FW$87,Apoio!$E$34+1,FALSE)","v":0},{"$f":"IF(B56>$F$35,0,SUM($D$37:D55)*Apoio!$D$33*Apoio!$D$34/12)","v":0}]
[null,21,{"$f":"VLOOKUP(B57,'DADOS DOS EMPREENDIMENTOS'!$O$47:$FW$87,Apoio!$E$34,FALSE)","v":0},{"$f":"VLOOKUP(B57,'DADOS DOS EMPREENDIMENTOS'!$O$47:$FW$87,Apoio!$E$34+1,FALSE)","v":0},{"$f":"IF(B57>$F$35,0,SUM($D$37:D56)*Apoio!$D$33*Apoio!$D$34/12)","v":0}]
[null,22,{"$f":"VLOOKUP(B58,'DADOS DOS EMPREENDIMENTOS'!$O$47:$FW$87,Apoio!$E$34,FALSE)","v":0},{"$f":"VLOOKUP(B58,'DADOS DOS EMPREENDIMENTOS'!$O$47:$FW$87,Apoio!$E$34+1,FALSE)","v":0},{"$f":"IF(B58>$F$35,0,SUM($D$37:D57)*Apoio!$D$33*Apoio!$D$34/12)","v":0}]
[null,23,{"$f":"VLOOKUP(B59,'DADOS DOS EMPREENDIMENTOS'!$O$47:$FW$87,Apoio!$E$34,FALSE)","v":0},{"$f":"VLOOKUP(B59,'DADOS DOS EMPREENDIMENTOS'!$O$47:$FW$87,Apoio!$E$34+1,FALSE)","v":0},{"$f":"IF(B59>$F$35,0,SUM($D$37:D58)*Apoio!$D$33*Apoio!$D$34/12)","v":0}]
[null,24,{"$f":"VLOOKUP(B60,'DADOS DOS EMPREENDIMENTOS'!$O$47:$FW$87,Apoio!$E$34,FALSE)","v":0},{"$f":"VLOOKUP(B60,'DADOS DOS EMPREENDIMENTOS'!$O$47:$FW$87,Apoio!$E$34+1,FALSE)","v":0},{"$f":"IF(B60>$F$35,0,SUM($D$37:D59)*Apoio!$D$33*Apoio!$D$34/12)","v":0}]
[null,25,{"$f":"VLOOKUP(B61,'DADOS DOS EMPREENDIMENTOS'!$O$47:$FW$87,Apoio!$E$34,FALSE)","v":0},{"$f":"VLOOKUP(B61,'DADOS DOS EMPREENDIMENTOS'!$O$47:$FW$87,Apoio!$E$34+1,FALSE)","v":0},{"$f":"IF(B61>$F$35,0,SUM($D$37:D60)*Apoio!$D$33*Apoio!$D$34/12)","v":0}]
[null,26,{"$f":"VLOOKUP(B62,'DADOS DOS EMPREENDIMENTOS'!$O$47:$FW$87,Apoio!$E$34,FALSE)","v":0},{"$f":"VLOOKUP(B62,'DADOS DOS EMPREENDIMENTOS'!$O$47:$FW$87,Apoio!$E$34+1,FALSE)","v":0},{"$f":"IF(B62>$F$35,0,SUM($D$37:D61)*Apoio!$D$33*Apoio!$D$34/12)","v":0}]
[null,27,{"$f":"VLOOKUP(B63,'DADOS DOS EMPREENDIMENTOS'!$O$47:$FW$87,Apoio!$E$34,FALSE)","v":0},{"$f":"VLOOKUP(B63,'DADOS DOS EMPREENDIMENTOS'!$O$47:$FW$87,Apoio!$E$34+1,FALSE)","v":0},{"$f":"IF(B63>$F$35,0,SUM($D$37:D62)*Apoio!$D$33*Apoio!$D$34/12)","v":0}]
[null,28,{"$f":"VLOOKUP(B64,'DADOS DOS EMPREENDIMENTOS'!$O$47:$FW$87,Apoio!$E$34,FALSE)","v":0},{"$f":"VLOOKUP(B64,'DADOS DOS EMPREENDIMENTOS'!$O$47:$FW$87,Apoio!$E$34+1,FALSE)","v":0},{"$f":"IF(B64>$F$35,0,SUM($D$37:D63)*Apoio!$D$33*Apoio!$D$34/12)","v":0}]
[null,29,{"$f":"VLOOKUP(B65,'DADOS DOS EMPREENDIMENTOS'!$O$47:$FW$87,Apoio!$E$34,FALSE)","v":0},{"$f":"VLOOKUP(B65,'DADOS DOS EMPREENDIMENTOS'!$O$47:$FW$87,Apoio!$E$34+1,FALSE)","v":0},{"$f":"IF(B65>$F$35,0,SUM($D$37:D64)*Apoio!$D$33*Apoio!$D$34/12)","v":0}]
[null,30,{"$f":"VLOOKUP(B66,'DADOS DOS EMPREENDIMENTOS'!$O$47:$FW$87,Apoio!$E$34,FALSE)","v":0},{"$f":"VLOOKUP(B66,'DADOS DOS EMPREENDIMENTOS'!$O$47:$FW$87,Apoio!$E$34+1,FALSE)","v":0},{"$f":"IF(B66>$F$35,0,SUM($D$37:D65)*Apoio!$D$33*Apoio!$D$34/12)","v":0}]
[null,31,{"$f":"VLOOKUP(B67,'DADOS DOS EMPREENDIMENTOS'!$O$47:$FW$87,Apoio!$E$34,FALSE)","v":0},{"$f":"VLOOKUP(B67,'DADOS DOS EMPREENDIMENTOS'!$O$47:$FW$87,Apoio!$E$34+1,FALSE)","v":0},{"$f":"IF(B67>$F$35,0,SUM($D$37:D66)*Apoio!$D$33*Apoio!$D$34/12)","v":0}]
[null,32,{"$f":"VLOOKUP(B68,'DADOS DOS EMPREENDIMENTOS'!$O$47:$FW$87,Apoio!$E$34,FALSE)","v":0},{"$f":"VLOOKUP(B68,'DADOS DOS EMPREENDIMENTOS'!$O$47:$FW$87,Apoio!$E$34+1,FALSE)","v":0},{"$f":"IF(B68>$F$35,0,SUM($D$37:D67)*Apoio!$D$33*Apoio!$D$34/12)","v":0}]
[null,33,{"$f":"VLOOKUP(B69,'DADOS DOS EMPREENDIMENTOS'!$O$47:$FW$87,Apoio!$E$34,FALSE)","v":0},{"$f":"VLOOKUP(B69,'DADOS DOS EMPREENDIMENTOS'!$O$47:$FW$87,Apoio!$E$34+1,FALSE)","v":0},{"$f":"IF(B69>$F$35,0,SUM($D$37:D68)*Apoio!$D$33*Apoio!$D$34/12)","v":0}]
[null,34,{"$f":"VLOOKUP(B70,'DADOS DOS EMPREENDIMENTOS'!$O$47:$FW$87,Apoio!$E$34,FALSE)","v":0},{"$f":"VLOOKUP(B70,'DADOS DOS EMPREENDIMENTOS'!$O$47:$FW$87,Apoio!$E$34+1,FALSE)","v":0},{"$f":"IF(B70>$F$35,0,SUM($D$37:D69)*Apoio!$D$33*Apoio!$D$34/12)","v":0}]
[null,35,{"$f":"VLOOKUP(B71,'DADOS DOS EMPREENDIMENTOS'!$O$47:$FW$87,Apoio!$E$34,FALSE)","v":0},{"$f":"VLOOKUP(B71,'DADOS DOS EMPREENDIMENTOS'!$O$47:$FW$87,Apoio!$E$34+1,FALSE)","v":0},{"$f":"IF(B71>$F$35,0,SUM($D$37:D70)*Apoio!$D$33*Apoio!$D$34/12)","v":0}]
[null,36,{"$f":"VLOOKUP(B72,'DADOS DOS EMPREENDIMENTOS'!$O$47:$FW$87,Apoio!$E$34,FALSE)","v":0},{"$f":"VLOOKUP(B72,'DADOS DOS EMPREENDIMENTOS'!$O$47:$FW$87,Apoio!$E$34+1,FALSE)","v":0},{"$f":"IF(B72>$F$35,0,SUM($D$37:D71)*Apoio!$D$33*Apoio!$D$34/12)","v":0}]
[null,37,{"$f":"VLOOKUP(B73,'DADOS DOS EMPREENDIMENTOS'!$O$47:$FW$87,Apoio!$E$34,FALSE)","v":0},{"$f":"VLOOKUP(B73,'DADOS DOS EMPREENDIMENTOS'!$O$47:$FW$87,Apoio!$E$34+1,FALSE)","v":0},{"$f":"IF(B73>$F$35,0,SUM($D$37:D72)*Apoio!$D$33*Apoio!$D$34/12)","v":0}]
[null,38,{"$f":"VLOOKUP(B74,'DADOS DOS EMPREENDIMENTOS'!$O$47:$FW$87,Apoio!$E$34,FALSE)","v":0},{"$f":"VLOOKUP(B74,'DADOS DOS EMPREENDIMENTOS'!$O$47:$FW$87,Apoio!$E$34+1,FALSE)","v":0},{"$f":"IF(B74>$F$35,0,SUM($D$37:D73)*Apoio!$D$33*Apoio!$D$34/12)","v":0}]
[null,39,{"$f":"VLOOKUP(B75,'DADOS DOS EMPREENDIMENTOS'!$O$47:$FW$87,Apoio!$E$34,FALSE)","v":0},{"$f":"VLOOKUP(B75,'DADOS DOS EMPREENDIMENTOS'!$O$47:$FW$87,Apoio!$E$34+1,FALSE)","v":0},{"$f":"IF(B75>$F$35,0,SUM($D$37:D74)*Apoio!$D$33*Apoio!$D$34/12)","v":0}]
[null,40,{"$f":"VLOOKUP(B76,'DADOS DOS EMPREENDIMENTOS'!$O$47:$FW$87,Apoio!$E$34,FALSE)","v":0},{"$f":"VLOOKUP(B76,'DADOS DOS EMPREENDIMENTOS'!$O$47:$FW$87,Apoio!$E$34+1,FALSE)","v":0},{"$f":"IF(B76>$F$35,0,SUM($D$37:D75)*Apoio!$D$33*Apoio!$D$34/12)","v":0}]

{"sheet":"Meses","index":4,"n_rows":307,"n_cols":3,"rows_kept":307,"cut":false,"hidden":true,"merged":[]}
[null,"2001-01-01","2014-10-01"]
["2006-07-01",{"$f":"+IF(DATE(YEAR('Proposta 1 Via'!$G$10),MONTH('Proposta 1 Via'!$G$10),DAY(Meses!$B$1))=Meses!A2,0,IF(Meses!A2<'Proposta 1 Via'!$G$10,\"\",B1+1))","v":""},"2015-02-01"]
["2006-08-01",{"$f":"+IF(DATE(YEAR('Proposta 1 Via'!$G$10),MONTH('Proposta 1 Via'!$G$10),DAY(Meses!$B$1))=Meses!A3,0,IF(Meses!A3<'Proposta 1 Via'!$G$10,\"\",B2+1))","v":""}]
["2006-09-01",{"$f":"+IF(DATE(YEAR('Proposta 1 Via'!$G$10),MONTH('Proposta 1 Via'!$G$10),DAY(Meses!$B$1))=Meses!A4,0,IF(Meses!A4<'Proposta 1 Via'!$G$10,\"\",B3+1))","v":""}]
["2006-10-01",{"$f":"+IF(DATE(YEAR('Proposta 1 Via'!$G$10),MONTH('Proposta 1 Via'!$G$10),DAY(Meses!$B$1))=Meses!A5,0,IF(Meses!A5<'Proposta 1 Via'!$G$10,\"\",B4+1))","v":""}]
["2006-11-01",{"$f":"+IF(DATE(YEAR('Proposta 1 Via'!$G$10),MONTH('Proposta 1 Via'!$G$10),DAY(Meses!$B$1))=Meses!A6,0,IF(Meses!A6<'Proposta 1 Via'!$G$10,\"\",B5+1))","v":""}]
["2006-12-01",{"$f":"+IF(DATE(YEAR('Proposta 1 Via'!$G$10),MONTH('Proposta 1 Via'!$G$10),DAY(Meses!$B$1))=Meses!A7,0,IF(Meses!A7<'Proposta 1 Via'!$G$10,\"\",B6+1))","v":""}]
["2007-01-01",{"$f":"+IF(DATE(YEAR('Proposta 1 Via'!$G$10),MONTH('Proposta 1 Via'!$G$10),DAY(Meses!$B$1))=Meses!A8,0,IF(Meses!A8<'Proposta 1 Via'!$G$10,\"\",B7+1))","v":""}]
["2007-02-01",{"$f":"+IF(DATE(YEAR('Proposta 1 Via'!$G$10),MONTH('Proposta 1 Via'!$G$10),DAY(Meses!$B$1))=Meses!A9,0,IF(Meses!A9<'Proposta 1 Via'!$G$10,\"\",B8+1))","v":""}]
["2007-03-01",{"$f":"+IF(DATE(YEAR('Proposta 1 Via'!$G$10),MONTH('Proposta 1 Via'!$G$10),DAY(Meses!$B$1))=Meses!A10,0,IF(Meses!A10<'Proposta 1 Via'!$G$10,\"\",B9+1))","v":""}]
["2007-04-01",{"$f":"+IF(DATE(YEAR('Proposta 1 Via'!$G$10),MONTH('Proposta 1 Via'!$G$10),DAY(Meses!$B$1))=Meses!A11,0,IF(Meses!A11<'Proposta 1 Via'!$G$10,\"\",B10+1))","v":""}]
["2007-05-01",{"$f":"+IF(DATE(YEAR('Proposta 1 Via'!$G$10),MONTH('Proposta 1 Via'!$G$10),DAY(Meses!$B$1))=Meses!A12,0,IF(Meses!A12<'Proposta 1 Via'!$G$10,\"\",B11+1))","v":""}]
["2007-06-01",{"$f":"+IF(DATE(YEAR('Proposta 1 Via'!$G$10),MONTH('Proposta 1 Via'!$G$10),DAY(Meses!$B$1))=Meses!A13,0,IF(Meses!A13<'Proposta 1 Via'!$G$10,\"\",B12+1))","v":""}]
["2007-07-01",{"$f":"+IF(DATE(YEAR('Proposta 1 Via'!$G$10),MONTH('Proposta 1 Via'!$G$10),DAY(Meses!$B$1))=Meses!A14,0,IF(Meses!A14<'Proposta 1 Via'!$G$10,\"\",B13+1))","v":""}]
["2007-08-01",{"$f":"+IF(DATE(YEAR('Proposta 1 Via'!$G$10),MONTH('Proposta 1 Via'!$G$10),DAY(Meses!$B$1))=Meses!A15,0,IF(Meses!A15<'Proposta 1 Via'!$G$10,\"\",B14+1))","v":""}]
["2007-09-01",{"$f":"+IF(DATE(YEAR('Proposta 1 Via'!$G$10),MONTH('Proposta 1 Via'!$G$10),DAY(Meses!$B$1))=Meses!A16,0,IF(Meses!A16<'Proposta 1 Via'!$G$10,\"\",B15+1))","v":""}]
["2007-10-01",{"$f":"+IF(DATE(YEAR('Proposta 1 Via'!$G$10),MONTH('Proposta 1 Via'!$G$10),DAY(Meses!$B$1))=Meses!A17,0,IF(Meses!A17<'Proposta 1 Via'!$G$10,\"\",B16+1))","v":""}]
["2007-11-01",{"$f":"+IF(DATE(YEAR('Proposta 1 Via'!$G$10),MONTH('Proposta 1 Via'!$G$10),DAY(Meses!$B$1))=Meses!A18,0,IF(Meses!A18<'Proposta 1 Via'!$G$10,\"\",B17+1))","v":""}]
["2007-12-01",{"$f":"+IF(DATE(YEAR('Proposta 1 Via'!$G$10),MONTH('Proposta 1 Via'!$G$10),DAY(Meses!$B$1))=Meses!A19,0,IF(Meses!A19<'Proposta 1 Via'!$G$10,\"\",B18+1))","v":""}]
["2008-01-01",{"$f":"+IF(DATE(YEAR('Proposta 1 Via'!$G$10),MONTH('Proposta 1 Via'!$G$10),DAY(Meses!$B$1))=Meses!A20,0,IF(Meses!A20<'Proposta 1 Via'!$G$10,\"\",B19+1))","v":""}]
["2008-02-01",{"$f":"+IF(DATE(YEAR('Proposta 1 Via'!$G$10),MONTH('Proposta 1 Via'!$G$10),DAY(Meses!$B$1))=Meses!A21,0,IF(Meses!A21<'Proposta 1 Via'!$G$10,\"\",B20+1))","v":""}]
["2008-03-01",{"$f":"+IF(DATE(YEAR('Proposta 1 Via'!$G$10),MONTH('Proposta 1 Via'!$G$10),DAY(Meses!$B$1))=Meses!A22,0,IF(Meses!A22<'Proposta 1 Via'!$G$10,\"\",B21+1))","v":""}]
["2008-04-01",{"$f":"+IF(DATE(YEAR('Proposta 1 Via'!$G$10),MONTH('Proposta 1 Via'!$G$10),DAY(Meses!$B$1))=Meses!A23,0,IF(Meses!A23<'Proposta 1 Via'!$G$10,\"\",B22+1))","v":""}]
["2008-05-01",{"$f":"+IF(DATE(YEAR('Proposta 1 Via'!$G$10),MONTH('Proposta 1 Via'!$G$10),DAY(Meses!$B$1))=Meses!A24,0,IF(Meses!A24<'Proposta 1 Via'!$G$10,\"\",B23+1))","v":""}]
["2008-06-01",{"$f":"+IF(DATE(YEAR('Proposta 1 Via'!$G$10),MONTH('Proposta 1 Via'!$G$10),DAY(Meses!$B$1))=Meses!A25,0,IF(Meses!A25<'Proposta 1 Via'!$G$10,\"\",B24+1))","v":""}]
["2008-07-01",{"$f":"+IF(DATE(YEAR('Proposta 1 Via'!$G$10),MONTH('Proposta 1 Via'!$G$10),DAY(Meses!$B$1))=Meses!A26,0,IF(Meses!A26<'Proposta 1 Via'!$G$10,\"\",B25+1))","v":""}]
["2008-08-01",{"$f":"+IF(DATE(YEAR('Proposta 1 Via'!$G$10),MONTH('Proposta 1 Via'!$G$10),DAY(Meses!$B$1))=Meses!A27,0,IF(Meses!A27<'Proposta 1 Via'!$G$10,\"\",B26+1))","v":""}]
["2008-09-01",{"$f":"+IF(DATE(YEAR('Proposta 1 Via'!$G$10),MONTH('Proposta 1 Via'!$G$10),DAY(Meses!$B$1))=Meses!A28,0,IF(Meses!A28<'Proposta 1 Via'!$G$10,\"\",B27+1))","v":""}]
["2008-10-01",{"$f":"+IF(DATE(YEAR('Proposta 1 Via'!$G$10),MONTH('Proposta 1 Via'!$G$10),DAY(Meses!$B$1))=Meses!A29,0,IF(Meses!A29<'Proposta 1 Via'!$G$10,\"\",B28+1))","v":""}]
["2008-11-01",{"$f":"+IF(DATE(YEAR('Proposta 1 Via'!$G$10),MONTH('Proposta 1 Via'!$G$10),DAY(Meses!$B$1))=Meses!A30,0,IF(Meses!A30<'Proposta 1 Via'!$G$10,\"\",B29+1))","v":""}]
["2008-12-01",{"$f":"+IF(DATE(YEAR('Proposta 1 Via'!$G$10),MONTH('Proposta 1 Via'!$G$10),DAY(Meses!$B$1))=Meses!A31,0,IF(Meses!A31<'Proposta 1 Via'!$G$10,\"\",B30+1))","v":""}]
["2009-01-01",{"$f":"+IF(DATE(YEAR('Proposta 1 Via'!$G$10),MONTH('Proposta 1 Via'!$G$10),DAY(Meses!$B$1))=Meses!A32,0,IF(Meses!A32<'Proposta 1 Via'!$G$10,\"\",B31+1))","v":""}]
["2009-02-01",{"$f":"+IF(DATE(YEAR('Proposta 1 Via'!$G$10),MONTH('Proposta 1 Via'!$G$10),DAY(Meses!$B$1))=Meses!A33,0,IF(Meses!A33<'Proposta 1 Via'!$G$10,\"\",B32+1))","v":""}]
["2009-03-01",{"$f":"+IF(DATE(YEAR('Proposta 1 Via'!$G$10),MONTH('Proposta 1 Via'!$G$10),DAY(Meses!$B$1))=Meses!A34,0,IF(Meses!A34<'Proposta 1 Via'!$G$10,\"\",B33+1))","v":""}]
["2009-04-01",{"$f":"+IF(DATE(YEAR('Proposta 1 Via'!$G$10),MONTH('Proposta 1 Via'!$G$10),DAY(Meses!$B$1))=Meses!A35,0,IF(Meses!A35<'Proposta 1 Via'!$G$10,\"\",B34+1))","v":""}]
["2009-05-01",{"$f":"+IF(DATE(YEAR('Proposta 1 Via'!$G$10),MONTH('Proposta 1 Via'!$G$10),DAY(Meses!$B$1))=Meses!A36,0,IF(Meses!A36<'Proposta 1 Via'!$G$10,\"\",B35+1))","v":""}]
["2009-06-01",{"$f":"+IF(DATE(YEAR('Proposta 1 Via'!$G$10),MONTH('Proposta 1 Via'!$G$10),DAY(Meses!$B$1))=Meses!A37,0,IF(Meses!A37<'Proposta 1 Via'!$G$10,\"\",B36+1))","v":""}]
["2009-07-01",{"$f":"+IF(DATE(YEAR('Proposta 1 Via'!$G$10),MONTH('Proposta 1 Via'!$G$10),DAY(Meses!$B$1))=Meses!A38,0,IF(Meses!A38<'Proposta 1 Via'!$G$10,\"\",B37+1))","v":""}]
["2009-08-01",{"$f":"+IF(DATE(YEAR('Proposta 1 Via'!$G$10),MONTH('Proposta 1 Via'!$G$10),DAY(Meses!$B$1))=Meses!A39,0,IF(Meses!A39<'Proposta 1 Via'!$G$10,\"\",B38+1))","v":""}]
["2009-09-01",{"$f":"+IF(DATE(YEAR('Proposta 1 Via'!$G$10),MONTH('Proposta 1 Via'!$G$10),DAY(Meses!$B$1))=Meses!A40,0,IF(Meses!A40<'Proposta 1 Via'!$G$10,\"\",B39+1))","v":""}]
["2009-10-01",{"$f":"+IF(DATE(YEAR('Proposta 1 Via'!$G$10),MONTH('Proposta 1 Via'!$G$10),DAY(Meses!$B$1))=Meses!A41,0,IF(Meses!A41<'Proposta 1 Via'!$G$10,\"\",B40+1))","v":""}]
["2009-11-01",{"$f":"+IF(DATE(YEAR('Proposta 1 Via'!$G$10),MONTH('Proposta 1 Via'!$G$10),DAY(Meses!$B$1))=Meses!A42,0,IF(Meses!A42<'Proposta 1 Via'!$G$10,\"\",B41+1))","v":""}]
["2009-12-01",{"$f":"+IF(DATE(YEAR('Proposta 1 Via'!$G$10),MONTH('Proposta 1 Via'!$G$10),DAY(Meses!$B$1))=Meses!A43,0,IF(Meses!A43<'Proposta 1 Via'!$G$10,\"\",B42+1))","v":""}]
["2010-01-01",{"$f":"+IF(DATE(YEAR('Proposta 1 Via'!$G$10),MONTH('Proposta 1 Via'!$G$10),DAY(Meses!$B$1))=Meses!A44,0,IF(Meses!A44<'Proposta 1 Via'!$G$10,\"\",B43+1))","v":""}]
["2010-02-01",{"$f":"+IF(DATE(YEAR('Proposta 1 Via'!$G$10),MONTH('Proposta 1 Via'!$G$10),DAY(Meses!$B$1))=Meses!A45,0,IF(Meses!A45<'Proposta 1 Via'!$G$10,\"\",B44+1))","v":""}]
["2010-03-01",{"$f":"+IF(DATE(YEAR('Proposta 1 Via'!$G$10),MONTH('Proposta 1 Via'!$G$10),DAY(Meses!$B$1))=Meses!A46,0,IF(Meses!A46<'Proposta 1 Via'!$G$10,\"\",B45+1))","v":""}]
["2010-04-01",{"$f":"+IF(DATE(YEAR('Proposta 1 Via'!$G$10),MONTH('Proposta 1 Via'!$G$10),DAY(Meses!$B$1))=Meses!A47,0,IF(Meses!A47<'Proposta 1 Via'!$G$10,\"\",B46+1))","v":""}]
["2010-05-01",{"$f":"+IF(DATE(YEAR('Proposta 1 Via'!$G$10),MONTH('Proposta 1 Via'!$G$10),DAY(Meses!$B$1))=Meses!A48,0,IF(Meses!A48<'Proposta 1 Via'!$G$10,\"\",B47+1))","v":""}]
["2010-06-01",{"$f":"+IF(DATE(YEAR('Proposta 1 Via'!$G$10),MONTH('Proposta 1 Via'!$G$10),DAY(Meses!$B$1))=Meses!A49,0,IF(Meses!A49<'Proposta 1 Via'!$G$10,\"\",B48+1))","v":""}]
["2010-07-01",{"$f":"+IF(DATE(YEAR('Proposta 1 Via'!$G$10),MONTH('Proposta 1 Via'!$G$10),DAY(Meses!$B$1))=Meses!A50,0,IF(Meses!A50<'Proposta 1 Via'!$G$10,\"\",B49+1))","v":""}]
["2010-08-01",{"$f":"+IF(DATE(YEAR('Proposta 1 Via'!$G$10),MONTH('Proposta 1 Via'!$G$10),DAY(Meses!$B$1))=Meses!A51,0,IF(Meses!A51<'Proposta 1 Via'!$G$10,\"\",B50+1))","v":""}]
["2010-09-01",{"$f":"+IF(DATE(YEAR('Proposta 1 Via'!$G$10),MONTH('Proposta 1 Via'!$G$10),DAY(Meses!$B$1))=Meses!A52,0,IF(Meses!A52<'Proposta 1 Via'!$G$10,\"\",B51+1))","v":""}]
["2010-10-01"]
["2010-11-01"]
["2010-12-01"]
["2011-01-01"]
["2011-02-01"]
["2011-03-01"]
["2011-04-01"]
["2011-05-01"]
["2011-06-01"]
["2011-07-01"]
["2011-08-01"]
["2011-09-01"]
["2011-10-01",{"$f":"+IF(DATE(YEAR('Proposta 1 Via'!$G$10),MONTH('Proposta 1 Via'!$G$10),DAY(Meses!$B$1))=Meses!A65,0,IF(Meses!A65<'Proposta 1 Via'!$G$10,\"\",B64+1))","v":""}]
["2011-11-01",{"$f":"+IF(DATE(YEAR('Proposta 1 Via'!$G$10),MONTH('Proposta 1 Via'!$G$10),DAY(Meses!$B$1))=Meses!A66,0,IF(Meses!A66<'Proposta 1 Via'!$G$10,\"\",B65+1))","v":""}]
["2011-12-01",{"$f":"+IF(DATE(YEAR('Proposta 1 Via'!$G$10),MONTH('Proposta 1 Via'!$G$10),DAY(Meses!$B$1))=Meses!A67,0,IF(Meses!A67<'Proposta 1 Via'!$G$10,\"\",B66+1))","v":""}]
["2012-01-01",{"$f":"+IF(DATE(YEAR('Proposta 1 Via'!$G$10),MONTH('Proposta 1 Via'!$G$10),DAY(Meses!$B$1))=Meses!A68,0,IF(Meses!A68<'Proposta 1 Via'!$G$10,\"\",B67+1))","v":""}]
["2012-02-01",{"$f":"+IF(DATE(YEAR('Proposta 1 Via'!$G$10),MONTH('Proposta 1 Via'!$G$10),DAY(Meses!$B$1))=Meses!A69,0,IF(Meses!A69<'Proposta 1 Via'!$G$10,\"\",B68+1))","v":""}]
["2012-03-01",{"$f":"+IF(DATE(YEAR('Proposta 1 Via'!$G$10),MONTH('Proposta 1 Via'!$G$10),DAY(Meses!$B$1))=Meses!A70,0,IF(Meses!A70<'Proposta 1 Via'!$G$10,\"\",B69+1))","v":""}]
["2012-04-01",{"$f":"+IF(DATE(YEAR('Proposta 1 Via'!$G$10),MONTH('Proposta 1 Via'!$G$10),DAY(Meses!$B$1))=Meses!A71,0,IF(Meses!A71<'Proposta 1 Via'!$G$10,\"\",B70+1))","v":""}]
["2012-05-01",{"$f":"+IF(DATE(YEAR('Proposta 1 Via'!$G$10),MONTH('Proposta 1 Via'!$G$10),DAY(Meses!$B$1))=Meses!A72,0,IF(Meses!A72<'Proposta 1 Via'!$G$10,\"\",B71+1))","v":""}]
["2012-06-01",{"$f":"+IF(DATE(YEAR('Proposta 1 Via'!$G$10),MONTH('Proposta 1 Via'!$G$10),DAY(Meses!$B$1))=Meses!A73,0,IF(Meses!A73<'Proposta 1 Via'!$G$10,\"\",B72+1))","v":""}]
["2012-07-01"]
["2012-08-01"]
["2012-09-01"]
["2012-10-01",{"$f":"+IF(DATE(YEAR('Proposta 1 Via'!$G$10),MONTH('Proposta 1 Via'!$G$10),DAY(Meses!$B$1))=Meses!A77,0,IF(Meses!A77<'Proposta 1 Via'!$G$10,\"\",B76+1))","v":""},{"$f":"IF(B77=4,\"Financiamento\",IF(A77=$C$1,\"Chaves\",IF(A77=$C$2,\"Chaves Contrato/Cliente\",\"\")))","v":""}]
["2012-11-01",{"$f":"+IF(DATE(YEAR('Proposta 1 Via'!$G$10),MONTH('Proposta 1 Via'!$G$10),DAY(Meses!$B$1))=Meses!A78,0,IF(Meses!A78<'Proposta 1 Via'!$G$10,\"\",B77+1))","v":""},{"$f":"IF(B78=4,\"Financiamento\",IF(A78=$C$1,\"Chaves\",IF(A78=$C$2,\"Chaves Contrato/Cliente\",\"\")))","v":""}]
["2012-12-01"]
["2013-01-01"]
["2013-02-01"]
["2013-03-01"]
["2013-04-01"]
["2013-05-01"]
["2013-06-01"]
["2013-07-01"]
["2013-08-01"]
["2013-09-01"]
["2013-10-01"]
["2013-11-01"]
["2013-12-01"]
["2014-01-01"]
["2014-02-01"]
["2014-03-01"]
["2014-04-01"]
["2014-05-01"]
["2014-06-01"]
["2014-07-01"]
["2014-08-01"]
["2014-09-01"]
["2014-10-01"]
["2014-11-01"]
["2014-12-01"]
["2015-01-01"]
["2015-02-01"]
["2015-03-01"]
["2015-04-01",{"$f":"+IF(DATE(YEAR('Proposta 1 Via'!$G$10),MONTH('Proposta 1 Via'!$G$10),DAY(Meses!$B$1))=Meses!A107,0,IF(Meses!A107<'Proposta 1 Via'!$G$10,\"\",B106+1))","v":""}]
["2015-05-01",0,"Lançamento"]
["2015-06-01",{"$f":"+IF(DATE(YEAR('Proposta 1 Via'!$G$10),MONTH('Proposta 1 Via'!$G$10),DAY(Meses!$B$1))=Meses!A109,0,IF(Meses!A109<'Proposta 1 Via'!$G$10,\"\",B108+1))","v":""},{"$f":"IF(B109=4,\"Financiamento\",IF(A109=$C$1,\"Chaves\",IF(A109=$C$2,\"Chaves Contrato/Cliente\",\"\")))","v":""}]
["2015-07-01",{"$f":"+IF(DATE(YEAR('Proposta 1 Via'!$G$10),MONTH('Proposta 1 Via'!$G$10),DAY(Meses!$B$1))=Meses!A110,0,IF(Meses!A110<'Proposta 1 Via'!$G$10,\"\",B109+1))","v":""},{"$f":"IF(B110=4,\"Financiamento\",IF(A110=$C$1,\"Chaves\",IF(A110=$C$2,\"Chaves Contrato/Cliente\",\"\")))","v":""}]
["2015-08-01",0,{"$f":"IF(B111=4,\"Financiamento\",IF(A111=$C$1,\"Chaves\",IF(A111=$C$2,\"Chaves Contrato/Cliente\",\"\")))","v":""}]
["2015-09-01",0]
["2015-10-01",{"$f":"+IF(DATE(YEAR('Proposta 1 Via'!$G$10),MONTH('Proposta 1 Via'!$G$10),DAY(Meses!$B$1))=Meses!A113,0,IF(Meses!A113<'Proposta 1 Via'!$G$10,\"\",B112+1))","v":""},{"$f":"IF(B113=4,\"Financiamento\",IF(A113=$C$1,\"Chaves\",IF(A113=$C$2,\"Chaves Contrato/Cliente\",\"\")))","v":""}]
["2015-11-01",{"$f":"+IF(DATE(YEAR('Proposta 1 Via'!$G$10),MONTH('Proposta 1 Via'!$G$10),DAY(Meses!$B$1))=Meses!A114,0,IF(Meses!A114<'Proposta 1 Via'!$G$10,\"\",B113+1))","v":""},{"$f":"IF(B114=4,\"Financiamento\",IF(A114=$C$1,\"Chaves\",IF(A114=$C$2,\"Chaves Contrato/Cliente\",\"\")))","v":""}]
["2015-12-01",0,{"$f":"IF(B115=4,\"Financiamento\",IF(A115=$C$1,\"Chaves\",IF(A115=$C$2,\"Chaves Contrato/Cliente\",\"\")))","v":""}]
["2016-01-01",0]
["2016-02-01",0]
["2016-03-01",{"$f":"+IF(DATE(YEAR('Proposta 1 Via'!$G$10),MONTH('Proposta 1 Via'!$G$10),DAY(Meses!$B$1))=Meses!A118,0,IF(Meses!A118<'Proposta 1 Via'!$G$10,\"\",B117+1))","v":""}]
["2016-04-01",0]
["2016-05-01",0]
["2016-06-01",0]
["2016-07-01",{"$f":"+IF(DATE(YEAR('Proposta 1 Via'!$G$10),MONTH('Proposta 1 Via'!$G$10),DAY(Meses!$B$1))=Meses!A122,0,IF(Meses!A122<'Proposta 1 Via'!$G$10,\"\",B121+1))","v":""}]
["2016-08-01",0]
["2016-09-01",{"$f":"+IF(DATE(YEAR('Proposta 1 Via'!$G$10),MONTH('Proposta 1 Via'!$G$10),DAY(Meses!$B$1))=Meses!A124,0,IF(Meses!A124<'Proposta 1 Via'!$G$10,\"\",B123+1))","v":""}]
["2016-10-01",0]
["2016-11-01",0]
["2016-12-01",0]
["2017-01-01",0]
["2017-02-01",0]
["2017-03-01",0]
["2017-04-01",0]
["2017-05-01",0]
["2017-06-01",0]
["2017-07-01",{"$f":"+IF(DATE(YEAR('Proposta 1 Via'!$G$10),MONTH('Proposta 1 Via'!$G$10),DAY(Meses!$B$1))=Meses!A134,0,IF(Meses!A134<'Proposta 1 Via'!$G$10,\"\",B133+1))","v":""}]
["2017-08-01",0]
["2017-09-01",0]
["2017-10-01",0]
["2017-11-01",{"$f":"+IF(DATE(YEAR('Proposta 1 Via'!$G$10),MONTH('Proposta 1 Via'!$G$10),DAY(Meses!$B$1))=Meses!A138,0,IF(Meses!A138<'Proposta 1 Via'!$G$10,\"\",B137+1))","v":""}]
["2017-12-01",0,"Chaves"]
["2018-01-01",0]
["2018-02-01",{"$f":"+IF(DATE(YEAR('Proposta 1 Via'!$G$10),MONTH('Proposta 1 Via'!$G$10),DAY(Meses!$B$1))=Meses!A141,0,IF(Meses!A141<'Proposta 1 Via'!$G$10,\"\",B140+1))","v":""}]
["2018-03-01",0]
["2018-04-01",0]
["2018-05-01",0]
["2018-06-01",0]
["2018-07-01",0]
["2018-08-01",0]
["2018-09-01",0]
["2018-10-01",0]
["2018-11-01",0]
["2018-12-01",0]
["2019-01-01",0]
["2019-02-01",0]
["2019-03-01",0]
["2019-04-01",0]
["2019-05-01",0]
["2019-06-01",0]
["2019-07-01",0]
["2019-08-01",0]
["2019-09-01",0]
["2019-10-01",0]
["2019-11-01",0]
["2019-12-01",0]
["2020-01-01",0]
["2020-02-01",0]
["2020-03-01",0]
["2020-04-01",{"$f":"+IF(DATE(YEAR('Proposta 1 Via'!$G$10),MONTH('Proposta 1 Via'!$G$10),DAY(Meses!$B$1))=Meses!A167,0,IF(Meses!A167<'Proposta 1 Via'!$G$10,\"\",B166+1))","v":""}]
["2020-05-01",0]
["2020-06-01",0]
["2020-07-01",0]
["2020-08-01",{"$f":"+IF(DATE(YEAR('Proposta 1 Via'!$G$10),MONTH('Proposta 1 Via'!$G$10),DAY(Meses!$B$1))=Meses!A171,0,IF(Meses!A171<'Proposta 1 Via'!$G$10,\"\",B170+1))","v":""}]
["2020-09-01",0]
["2020-10-01",0]
["2020-11-01",0]
["2020-12-01",0]
["2021-01-01",{"$f":"+IF(DATE(YEAR('Proposta 1 Via'!$G$10),MONTH('Proposta 1 Via'!$G$10),DAY(Meses!$B$1))=Meses!A176,0,IF(Meses!A176<'Proposta 1 Via'!$G$10,\"\",B175+1))","v":""}]
["2021-02-01",0]
["2021-03-01",{"$f":"+IF(DATE(YEAR('Proposta 1 Via'!$G$10),MONTH('Proposta 1 Via'!$G$10),DAY(Meses!$B$1))=Meses!A178,0,IF(Meses!A178<'Proposta 1 Via'!$G$10,\"\",B177+1))","v":""}]
["2021-04-01",{"$f":"+IF(DATE(YEAR('Proposta 1 Via'!$G$10),MONTH('Proposta 1 Via'!$G$10),DAY(Meses!$B$1))=Meses!A179,0,IF(Meses!A179<'Proposta 1 Via'!$G$10,\"\",B178+1))","v":""}]
["2021-05-01",0]
["2021-06-01",0]
["2021-07-01",{"$f":"+IF(DATE(YEAR('Proposta 1 Via'!$G$10),MONTH('Proposta 1 Via'!$G$10),DAY(Meses!$B$1))=Meses!A182,0,IF(Meses!A182<'Proposta 1 Via'!$G$10,\"\",B181+1))","v":""}]
["2021-08-01",{"$f":"+IF(DATE(YEAR('Proposta 1 Via'!$G$10),MONTH('Proposta 1 Via'!$G$10),DAY(Meses!$B$1))=Meses!A183,0,IF(Meses!A183<'Proposta 1 Via'!$G$10,\"\",B182+1))","v":""}]
["2021-09-01",{"$f":"+IF(DATE(YEAR('Proposta 1 Via'!$G$10),MONTH('Proposta 1 Via'!$G$10),DAY(Meses!$B$1))=Meses!A184,0,IF(Meses!A184<'Proposta 1 Via'!$G$10,\"\",B183+1))","v":0}]
["2021-10-01",{"$f":"+IF(DATE(YEAR('Proposta 1 Via'!$G$10),MONTH('Proposta 1 Via'!$G$10),DAY(Meses!$B$1))=Meses!A185,0,IF(Meses!A185<'Proposta 1 Via'!$G$10,\"\",B184+1))","v":1}]
["2021-11-01",{"$f":"+IF(DATE(YEAR('Proposta 1 Via'!$G$10),MONTH('Proposta 1 Via'!$G$10),DAY(Meses!$B$1))=Meses!A186,0,IF(Meses!A186<'Proposta 1 Via'!$G$10,\"\",B185+1))","v":2}]
["2021-12-01",{"$f":"+IF(DATE(YEAR('Proposta 1 Via'!$G$10),MONTH('Proposta 1 Via'!$G$10),DAY(Meses!$B$1))=Meses!A187,0,IF(Meses!A187<'Proposta 1 Via'!$G$10,\"\",B186+1))","v":3}]
["2022-01-01",{"$f":"+IF(DATE(YEAR('Proposta 1 Via'!$G$10),MONTH('Proposta 1 Via'!$G$10),DAY(Meses!$B$1))=Meses!A188,0,IF(Meses!A188<'Proposta 1 Via'!$G$10,\"\",B187+1))","v":4}]
["2022-02-01",{"$f":"+IF(DATE(YEAR('Proposta 1 Via'!$G$10),MONTH('Proposta 1 Via'!$G$10),DAY(Meses!$B$1))=Meses!A189,0,IF(Meses!A189<'Proposta 1 Via'!$G$10,\"\",B188+1))","v":5}]
["2022-03-01",{"$f":"+IF(DATE(YEAR('Proposta 1 Via'!$G$10),MONTH('Proposta 1 Via'!$G$10),DAY(Meses!$B$1))=Meses!A190,0,IF(Meses!A190<'Proposta 1 Via'!$G$10,\"\",B189+1))","v":6}]
["2022-04-01",{"$f":"+IF(DATE(YEAR('Proposta 1 Via'!$G$10),MONTH('Proposta 1 Via'!$G$10),DAY(Meses!$B$1))=Meses!A191,0,IF(Meses!A191<'Proposta 1 Via'!$G$10,\"\",B190+1))","v":7}]
["2022-05-01",{"$f":"+IF(DATE(YEAR('Proposta 1 Via'!$G$10),MONTH('Proposta 1 Via'!$G$10),DAY(Meses!$B$1))=Meses!A192,0,IF(Meses!A192<'Proposta 1 Via'!$G$10,\"\",B191+1))","v":8}]
["2022-06-01",{"$f":"+IF(DATE(YEAR('Proposta 1 Via'!$G$10),MONTH('Proposta 1 Via'!$G$10),DAY(Meses!$B$1))=Meses!A193,0,IF(Meses!A193<'Proposta 1 Via'!$G$10,\"\",B192+1))","v":9}]
["2022-07-01",{"$f":"+IF(DATE(YEAR('Proposta 1 Via'!$G$10),MONTH('Proposta 1 Via'!$G$10),DAY(Meses!$B$1))=Meses!A194,0,IF(Meses!A194<'Proposta 1 Via'!$G$10,\"\",B193+1))","v":10}]
["2022-08-01",{"$f":"+IF(DATE(YEAR('Proposta 1 Via'!$G$10),MONTH('Proposta 1 Via'!$G$10),DAY(Meses!$B$1))=Meses!A195,0,IF(Meses!A195<'Proposta 1 Via'!$G$10,\"\",B194+1))","v":11}]
["2022-09-01",{"$f":"+IF(DATE(YEAR('Proposta 1 Via'!$G$10),MONTH('Proposta 1 Via'!$G$10),DAY(Meses!$B$1))=Meses!A196,0,IF(Meses!A196<'Proposta 1 Via'!$G$10,\"\",B195+1))","v":12}]
["2022-10-01",{"$f":"+IF(DATE(YEAR('Proposta 1 Via'!$G$10),MONTH('Proposta 1 Via'!$G$10),DAY(Meses!$B$1))=Meses!A197,0,IF(Meses!A197<'Proposta 1 Via'!$G$10,\"\",B196+1))","v":13}]
["2022-11-01",{"$f":"+IF(DATE(YEAR('Proposta 1 Via'!$G$10),MONTH('Proposta 1 Via'!$G$10),DAY(Meses!$B$1))=Meses!A198,0,IF(Meses!A198<'Proposta 1 Via'!$G$10,\"\",B197+1))","v":14}]
["2022-12-01",{"$f":"+IF(DATE(YEAR('Proposta 1 Via'!$G$10),MONTH('Proposta 1 Via'!$G$10),DAY(Meses!$B$1))=Meses!A199,0,IF(Meses!A199<'Proposta 1 Via'!$G$10,\"\",B198+1))","v":15}]
["2023-01-01",{"$f":"+IF(DATE(YEAR('Proposta 1 Via'!$G$10),MONTH('Proposta 1 Via'!$G$10),DAY(Meses!$B$1))=Meses!A200,0,IF(Meses!A200<'Proposta 1 Via'!$G$10,\"\",B199+1))","v":16}]
["2023-02-01",{"$f":"+IF(DATE(YEAR('Proposta 1 Via'!$G$10),MONTH('Proposta 1 Via'!$G$10),DAY(Meses!$B$1))=Meses!A201,0,IF(Meses!A201<'Proposta 1 Via'!$G$10,\"\",B200+1))","v":17}]
["2023-03-01",{"$f":"+IF(DATE(YEAR('Proposta 1 Via'!$G$10),MONTH('Proposta 1 Via'!$G$10),DAY(Meses!$B$1))=Meses!A202,0,IF(Meses!A202<'Proposta 1 Via'!$G$10,\"\",B201+1))","v":18}]
["2023-04-01",{"$f":"+IF(DATE(YEAR('Proposta 1 Via'!$G$10),MONTH('Proposta 1 Via'!$G$10),DAY(Meses!$B$1))=Meses!A203,0,IF(Meses!A203<'Proposta 1 Via'!$G$10,\"\",B202+1))","v":19}]
["2023-05-01",{"$f":"+IF(DATE(YEAR('Proposta 1 Via'!$G$10),MONTH('Proposta 1 Via'!$G$10),DAY(Meses!$B$1))=Meses!A204,0,IF(Meses!A204<'Proposta 1 Via'!$G$10,\"\",B203+1))","v":20}]
["2023-06-01",{"$f":"+IF(DATE(YEAR('Proposta 1 Via'!$G$10),MONTH('Proposta 1 Via'!$G$10),DAY(Meses!$B$1))=Meses!A205,0,IF(Meses!A205<'Proposta 1 Via'!$G$10,\"\",B204+1))","v":21}]
["2023-07-01",{"$f":"+IF(DATE(YEAR('Proposta 1 Via'!$G$10),MONTH('Proposta 1 Via'!$G$10),DAY(Meses!$B$1))=Meses!A206,0,IF(Meses!A206<'Proposta 1 Via'!$G$10,\"\",B205+1))","v":22}]
["2023-08-01",{"$f":"+IF(DATE(YEAR('Proposta 1 Via'!$G$10),MONTH('Proposta 1 Via'!$G$10),DAY(Meses!$B$1))=Meses!A207,0,IF(Meses!A207<'Proposta 1 Via'!$G$10,\"\",B206+1))","v":23}]
["2023-09-01",{"$f":"+IF(DATE(YEAR('Proposta 1 Via'!$G$10),MONTH('Proposta 1 Via'!$G$10),DAY(Meses!$B$1))=Meses!A208,0,IF(Meses!A208<'Proposta 1 Via'!$G$10,\"\",B207+1))","v":24}]
["2023-10-01",{"$f":"+IF(DATE(YEAR('Proposta 1 Via'!$G$10),MONTH('Proposta 1 Via'!$G$10),DAY(Meses!$B$1))=Meses!A209,0,IF(Meses!A209<'Proposta 1 Via'!$G$10,\"\",B208+1))","v":25}]
["2023-11-01",{"$f":"+IF(DATE(YEAR('Proposta 1 Via'!$G$10),MONTH('Proposta 1 Via'!$G$10),DAY(Meses!$B$1))=Meses!A210,0,IF(Meses!A210<'Proposta 1 Via'!$G$10,\"\",B209+1))","v":26}]
["2023-12-01",{"$f":"+IF(DATE(YEAR('Proposta 1 Via'!$G$10),MONTH('Proposta 1 Via'!$G$10),DAY(Meses!$B$1))=Meses!A211,0,IF(Meses!A211<'Proposta 1 Via'!$G$10,\"\",B210+1))","v":27}]
["2024-01-01",{"$f":"+IF(DATE(YEAR('Proposta 1 Via'!$G$10),MONTH('Proposta 1 Via'!$G$10),DAY(Meses!$B$1))=Meses!A212,0,IF(Meses!A212<'Proposta 1 Via'!$G$10,\"\",B211+1))","v":28}]
["2024-02-01",{"$f":"+IF(DATE(YEAR('Proposta 1 Via'!$G$10),MONTH('Proposta 1 Via'!$G$10),DAY(Meses!$B$1))=Meses!A213,0,IF(Meses!A213<'Proposta 1 Via'!$G$10,\"\",B212+1))","v":29}]
["2024-03-01",{"$f":"+IF(DATE(YEAR('Proposta 1 Via'!$G$10),MONTH('Proposta 1 Via'!$G$10),DAY(Meses!$B$1))=Meses!A214,0,IF(Meses!A214<'Proposta 1 Via'!$G$10,\"\",B213+1))","v":30}]
["2024-04-01",{"$f":"+IF(DATE(YEAR('Proposta 1 Via'!$G$10),MONTH('Proposta 1 Via'!$G$10),DAY(Meses!$B$1))=Meses!A215,0,IF(Meses!A215<'Proposta 1 Via'!$G$10,\"\",B214+1))","v":31}]
["2024-05-01",{"$f":"+IF(DATE(YEAR('Proposta 1 Via'!$G$10),MONTH('Proposta 1 Via'!$G$10),DAY(Meses!$B$1))=Meses!A216,0,IF(Meses!A216<'Proposta 1 Via'!$G$10,\"\",B215+1))","v":32}]
["2024-06-01",{"$f":"+IF(DATE(YEAR('Proposta 1 Via'!$G$10),MONTH('Proposta 1 Via'!$G$10),DAY(Meses!$B$1))=Meses!A217,0,IF(Meses!A217<'Proposta 1 Via'!$G$10,\"\",B216+1))","v":33}]
["2024-07-01",{"$f":"+IF(DATE(YEAR('Proposta 1 Via'!$G$10),MONTH('Proposta 1 Via'!$G$10),DAY(Meses!$B$1))=Meses!A218,0,IF(Meses!A218<'Proposta 1 Via'!$G$10,\"\",B217+1))","v":34}]
["2024-08-01",{"$f":"+IF(DATE(YEAR('Proposta 1 Via'!$G$10),MONTH('Proposta 1 Via'!$G$10),DAY(Meses!$B$1))=Meses!A219,0,IF(Meses!A219<'Proposta 1 Via'!$G$10,\"\",B218+1))","v":35}]
["2024-09-01",{"$f":"+IF(DATE(YEAR('Proposta 1 Via'!$G$10),MONTH('Proposta 1 Via'!$G$10),DAY(Meses!$B$1))=Meses!A220,0,IF(Meses!A220<'Proposta 1 Via'!$G$10,\"\",B219+1))","v":36}]
["2024-10-01",{"$f":"+IF(DATE(YEAR('Proposta 1 Via'!$G$10),MONTH('Proposta 1 Via'!$G$10),DAY(Meses!$B$1))=Meses!A221,0,IF(Meses!A221<'Proposta 1 Via'!$G$10,\"\",B220+1))","v":37}]
["2024-11-01",{"$f":"+IF(DATE(YEAR('Proposta 1 Via'!$G$10),MONTH('Proposta 1 Via'!$G$10),DAY(Meses!$B$1))=Meses!A222,0,IF(Meses!A222<'Proposta 1 Via'!$G$10,\"\",B221+1))","v":38}]
["2024-12-01",{"$f":"+IF(DATE(YEAR('Proposta 1 Via'!$G$10),MONTH('Proposta 1 Via'!$G$10),DAY(Meses!$B$1))=Meses!A223,0,IF(Meses!A223<'Proposta 1 Via'!$G$10,\"\",B222+1))","v":39}]
["2025-01-01",{"$f":"+IF(DATE(YEAR('Proposta 1 Via'!$G$10),MONTH('Proposta 1 Via'!$G$10),DAY(Meses!$B$1))=Meses!A224,0,IF(Meses!A224<'Proposta 1 Via'!$G$10,\"\",B223+1))","v":40}]
["2025-02-01",{"$f":"+IF(DATE(YEAR('Proposta 1 Via'!$G$10),MONTH('Proposta 1 Via'!$G$10),DAY(Meses!$B$1))=Meses!A225,0,IF(Meses!A225<'Proposta 1 Via'!$G$10,\"\",B224+1))","v":41}]
["2025-03-01",{"$f":"+IF(DATE(YEAR('Proposta 1 Via'!$G$10),MONTH('Proposta 1 Via'!$G$10),DAY(Meses!$B$1))=Meses!A226,0,IF(Meses!A226<'Proposta 1 Via'!$G$10,\"\",B225+1))","v":42}]
["2025-04-01",{"$f":"+IF(DATE(YEAR('Proposta 1 Via'!$G$10),MONTH('Proposta 1 Via'!$G$10),DAY(Meses!$B$1))=Meses!A227,0,IF(Meses!A227<'Proposta 1 Via'!$G$10,\"\",B226+1))","v":43}]
["2025-05-01",{"$f":"+IF(DATE(YEAR('Proposta 1 Via'!$G$10),MONTH('Proposta 1 Via'!$G$10),DAY(Meses!$B$1))=Meses!A228,0,IF(Meses!A228<'Proposta 1 Via'!$G$10,\"\",B227+1))","v":44}]
["2025-06-01",{"$f":"+IF(DATE(YEAR('Proposta 1 Via'!$G$10),MONTH('Proposta 1 Via'!$G$10),DAY(Meses!$B$1))=Meses!A229,0,IF(Meses!A229<'Proposta 1 Via'!$G$10,\"\",B228+1))","v":45}]
["2025-07-01",{"$f":"+IF(DATE(YEAR('Proposta 1 Via'!$G$10),MONTH('Proposta 1 Via'!$G$10),DAY(Meses!$B$1))=Meses!A230,0,IF(Meses!A230<'Proposta 1 Via'!$G$10,\"\",B229+1))","v":46}]
["2025-08-01",{"$f":"+IF(DATE(YEAR('Proposta 1 Via'!$G$10),MONTH('Proposta 1 Via'!$G$10),DAY(Meses!$B$1))=Meses!A231,0,IF(Meses!A231<'Proposta 1 Via'!$G$10,\"\",B230+1))","v":47}]
["2025-09-01",{"$f":"+IF(DATE(YEAR('Proposta 1 Via'!$G$10),MONTH('Proposta 1 Via'!$G$10),DAY(Meses!$B$1))=Meses!A232,0,IF(Meses!A232<'Proposta 1 Via'!$G$10,\"\",B231+1))","v":48}]
["2025-10-01",{"$f":"+IF(DATE(YEAR('Proposta 1 Via'!$G$10),MONTH('Proposta 1 Via'!$G$10),DAY(Meses!$B$1))=Meses!A233,0,IF(Meses!A233<'Proposta 1 Via'!$G$10,\"\",B232+1))","v":49}]
["2025-11-01",{"$f":"+IF(DATE(YEAR('Proposta 1 Via'!$G$10),MONTH('Proposta 1 Via'!$G$10),DAY(Meses!$B$1))=Meses!A234,0,IF(Meses!A234<'Proposta 1 Via'!$G$10,\"\",B233+1))","v":50}]
["2025-12-01",{"$f":"+IF(DATE(YEAR('Proposta 1 Via'!$G$10),MONTH('Proposta 1 Via'!$G$10),DAY(Meses!$B$1))=Meses!A235,0,IF(Meses!A235<'Proposta 1 Via'!$G$10,\"\",B234+1))","v":51}]
["2026-01-01",{"$f":"+IF(DATE(YEAR('Proposta 1 Via'!$G$10),MONTH('Proposta 1 Via'!$G$10),DAY(Meses!$B$1))=Meses!A236,0,IF(Meses!A236<'Proposta 1 Via'!$G$10,\"\",B235+1))","v":52}]
["2026-02-01",{"$f":"+IF(DATE(YEAR('Proposta 1 Via'!$G$10),MONTH('Proposta 1 Via'!$G$10),DAY(Meses!$B$1))=Meses!A237,0,IF(Meses!A237<'Proposta 1 Via'!$G$10,\"\",B236+1))","v":53}]
["2026-03-01",{"$f":"+IF(DATE(YEAR('Proposta 1 Via'!$G$10),MONTH('Proposta 1 Via'!$G$10),DAY(Meses!$B$1))=Meses!A238,0,IF(Meses!A238<'Proposta 1 Via'!$G$10,\"\",B237+1))","v":54}]
["2026-04-01",{"$f":"+IF(DATE(YEAR('Proposta 1 Via'!$G$10),MONTH('Proposta 1 Via'!$G$10),DAY(Meses!$B$1))=Meses!A239,0,IF(Meses!A239<'Proposta 1 Via'!$G$10,\"\",B238+1))","v":55}]
["2026-05-01",{"$f":"+IF(DATE(YEAR('Proposta 1 Via'!$G$10),MONTH('Proposta 1 Via'!$G$10),DAY(Meses!$B$1))=Meses!A240,0,IF(Meses!A240<'Proposta 1 Via'!$G$10,\"\",B239+1))","v":56}]
["2026-06-01",{"$f":"+IF(DATE(YEAR('Proposta 1 Via'!$G$10),MONTH('Proposta 1 Via'!$G$10),DAY(Meses!$B$1))=Meses!A241,0,IF(Meses!A241<'Proposta 1 Via'!$G$10,\"\",B240+1))","v":57}]
["2026-07-01",{"$f":"+IF(DATE(YEAR('Proposta 1 Via'!$G$10),MONTH('Proposta 1 Via'!$G$10),DAY(Meses!$B$1))=Meses!A242,0,IF(Meses!A242<'Proposta 1 Via'!$G$10,\"\",B241+1))","v":58}]
["2026-08-01",{"$f":"+IF(DATE(YEAR('Proposta 1 Via'!$G$10),MONTH('Proposta 1 Via'!$G$10),DAY(Meses!$B$1))=Meses!A243,0,IF(Meses!A243<'Proposta 1 Via'!$G$10,\"\",B242+1))","v":59}]
["2026-09-01",{"$f":"+IF(DATE(YEAR('Proposta 1 Via'!$G$10),MONTH('Proposta 1 Via'!$G$10),DAY(Meses!$B$1))=Meses!A244,0,IF(Meses!A244<'Proposta 1 Via'!$G$10,\"\",B243+1))","v":60}]
["2026-10-01",{"$f":"+IF(DATE(YEAR('Proposta 1 Via'!$G$10),MONTH('Proposta 1 Via'!$G$10),DAY(Meses!$B$1))=Meses!A245,0,IF(Meses!A245<'Proposta 1 Via'!$G$10,\"\",B244+1))","v":61}]
["2026-11-01",{"$f":"+IF(DATE(YEAR('Proposta 1 Via'!$G$10),MONTH('Proposta 1 Via'!$G$10),DAY(Meses!$B$1))=Meses!A246,0,IF(Meses!A246<'Proposta 1 Via'!$G$10,\"\",B245+1))","v":62}]
["2026-12-01",{"$f":"+IF(DATE(YEAR('Proposta 1 Via'!$G$10),MONTH('Proposta 1 Via'!$G$10),DAY(Meses!$B$1))=Meses!A247,0,IF(Meses!A247<'Proposta 1 Via'!$G$10,\"\",B246+1))","v":63}]
["2027-01-01",{"$f":"+IF(DATE(YEAR('Proposta 1 Via'!$G$10),MONTH('Proposta 1 Via'!$G$10),DAY(Meses!$B$1))=Meses!A248,0,IF(Meses!A248<'Proposta 1 Via'!$G$10,\"\",B247+1))","v":64}]
["2027-02-01",{"$f":"+IF(DATE(YEAR('Proposta 1 Via'!$G$10),MONTH('Proposta 1 Via'!$G$10),DAY(Meses!$B$1))=Meses!A249,0,IF(Meses!A249<'Proposta 1 Via'!$G$10,\"\",B248+1))","v":65}]
["2027-03-01",{"$f":"+IF(DATE(YEAR('Proposta 1 Via'!$G$10),MONTH('Proposta 1 Via'!$G$10),DAY(Meses!$B$1))=Meses!A250,0,IF(Meses!A250<'Proposta 1 Via'!$G$10,\"\",B249+1))","v":66}]
["2027-04-01",{"$f":"+IF(DATE(YEAR('Proposta 1 Via'!$G$10),MONTH('Proposta 1 Via'!$G$10),DAY(Meses!$B$1))=Meses!A251,0,IF(Meses!A251<'Proposta 1 Via'!$G$10,\"\",B250+1))","v":67}]
["2027-05-01",{"$f":"+IF(DATE(YEAR('Proposta 1 Via'!$G$10),MONTH('Proposta 1 Via'!$G$10),DAY(Meses!$B$1))=Meses!A252,0,IF(Meses!A252<'Proposta 1 Via'!$G$10,\"\",B251+1))","v":68}]
["2027-06-01",{"$f":"+IF(DATE(YEAR('Proposta 1 Via'!$G$10),MONTH('Proposta 1 Via'!$G$10),DAY(Meses!$B$1))=Meses!A253,0,IF(Meses!A253<'Proposta 1 Via'!$G$10,\"\",B252+1))","v":69}]
["2027-07-01",{"$f":"+IF(DATE(YEAR('Proposta 1 Via'!$G$10),MONTH('Proposta 1 Via'!$G$10),DAY(Meses!$B$1))=Meses!A254,0,IF(Meses!A254<'Proposta 1 Via'!$G$10,\"\",B253+1))","v":70}]
["2027-08-01",{"$f":"+IF(DATE(YEAR('Proposta 1 Via'!$G$10),MONTH('Proposta 1 Via'!$G$10),DAY(Meses!$B$1))=Meses!A255,0,IF(Meses!A255<'Proposta 1 Via'!$G$10,\"\",B254+1))","v":71}]
["2027-09-01",{"$f":"+IF(DATE(YEAR('Proposta 1 Via'!$G$10),MONTH('Proposta 1 Via'!$G$10),DAY(Meses!$B$1))=Meses!A256,0,IF(Meses!A256<'Proposta 1 Via'!$G$10,\"\",B255+1))","v":72}]
["2027-10-01",{"$f":"+IF(DATE(YEAR('Proposta 1 Via'!$G$10),MONTH('Proposta 1 Via'!$G$10),DAY(Meses!$B$1))=Meses!A257,0,IF(Meses!A257<'Proposta 1 Via'!$G$10,\"\",B256+1))","v":73}]
["2027-11-01",{"$f":"+IF(DATE(YEAR('Proposta 1 Via'!$G$10),MONTH('Proposta 1 Via'!$G$10),DAY(Meses!$B$1))=Meses!A258,0,IF(Meses!A258<'Proposta 1 Via'!$G$10,\"\",B257+1))","v":74}]
["2027-12-01",{"$f":"+IF(DATE(YEAR('Proposta 1 Via'!$G$10),MONTH('Proposta 1 Via'!$G$10),DAY(Meses!$B$1))=Meses!A259,0,IF(Meses!A259<'Proposta 1 Via'!$G$10,\"\",B258+1))","v":75}]
["2028-01-01",{"$f":"+IF(DATE(YEAR('Proposta 1 Via'!$G$10),MONTH('Proposta 1 Via'!$G$10),DAY(Meses!$B$1))=Meses!A260,0,IF(Meses!A260<'Proposta 1 Via'!$G$10,\"\",B259+1))","v":76}]
["2028-02-01",{"$f":"+IF(DATE(YEAR('Proposta 1 Via'!$G$10),MONTH('Proposta 1 Via'!$G$10),DAY(Meses!$B$1))=Meses!A261,0,IF(Meses!A261<'Proposta 1 Via'!$G$10,\"\",B260+1))","v":77}]
["2028-03-01",{"$f":"+IF(DATE(YEAR('Proposta 1 Via'!$G$10),MONTH('Proposta 1 Via'!$G$10),DAY(Meses!$B$1))=Meses!A262,0,IF(Meses!A262<'Proposta 1 Via'!$G$10,\"\",B261+1))","v":78}]
["2028-04-01",{"$f":"+IF(DATE(YEAR('Proposta 1 Via'!$G$10),MONTH('Proposta 1 Via'!$G$10),DAY(Meses!$B$1))=Meses!A263,0,IF(Meses!A263<'Proposta 1 Via'!$G$10,\"\",B262+1))","v":79}]
["2028-05-01",{"$f":"+IF(DATE(YEAR('Proposta 1 Via'!$G$10),MONTH('Proposta 1 Via'!$G$10),DAY(Meses!$B$1))=Meses!A264,0,IF(Meses!A264<'Proposta 1 Via'!$G$10,\"\",B263+1))","v":80}]
["2028-06-01",{"$f":"+IF(DATE(YEAR('Proposta 1 Via'!$G$10),MONTH('Proposta 1 Via'!$G$10),DAY(Meses!$B$1))=Meses!A265,0,IF(Meses!A265<'Proposta 1 Via'!$G$10,\"\",B264+1))","v":81}]
["2028-07-01",{"$f":"+IF(DATE(YEAR('Proposta 1 Via'!$G$10),MONTH('Proposta 1 Via'!$G$10),DAY(Meses!$B$1))=Meses!A266,0,IF(Meses!A266<'Proposta 1 Via'!$G$10,\"\",B265+1))","v":82}]
["2028-08-01",{"$f":"+IF(DATE(YEAR('Proposta 1 Via'!$G$10),MONTH('Proposta 1 Via'!$G$10),DAY(Meses!$B$1))=Meses!A267,0,IF(Meses!A267<'Proposta 1 Via'!$G$10,\"\",B266+1))","v":83}]
["2028-09-01",{"$f":"+IF(DATE(YEAR('Proposta 1 Via'!$G$10),MONTH('Proposta 1 Via'!$G$10),DAY(Meses!$B$1))=Meses!A268,0,IF(Meses!A268<'Proposta 1 Via'!$G$10,\"\",B267+1))","v":84}]
["2028-10-01",{"$f":"+IF(DATE(YEAR('Proposta 1 Via'!$G$10),MONTH('Proposta 1 Via'!$G$10),DAY(Meses!$B$1))=Meses!A269,0,IF(Meses!A269<'Proposta 1 Via'!$G$10,\"\",B268+1))","v":85}]
["2028-11-01",{"$f":"+IF(DATE(YEAR('Proposta 1 Via'!$G$10),MONTH('Proposta 1 Via'!$G$10),DAY(Meses!$B$1))=Meses!A270,0,IF(Meses!A270<'Proposta 1 Via'!$G$10,\"\",B269+1))","v":86}]
["2028-12-01",{"$f":"+IF(DATE(YEAR('Proposta 1 Via'!$G$10),MONTH('Proposta 1 Via'!$G$10),DAY(Meses!$B$1))=Meses!A271,0,IF(Meses!A271<'Proposta 1 Via'!$G$10,\"\",B270+1))","v":87}]
["2029-01-01",{"$f":"+IF(DATE(YEAR('Proposta 1 Via'!$G$10),MONTH('Proposta 1 Via'!$G$10),DAY(Meses!$B$1))=Meses!A272,0,IF(Meses!A272<'Proposta 1 Via'!$G$10,\"\",B271+1))","v":88}]
["2029-02-01",{"$f":"+IF(DATE(YEAR('Proposta 1 Via'!$G$10),MONTH('Proposta 1 Via'!$G$10),DAY(Meses!$B$1))=Meses!A273,0,IF(Meses!A273<'Proposta 1 Via'!$G$10,\"\",B272+1))","v":89}]
["2029-03-01",{"$f":"+IF(DATE(YEAR('Proposta 1 Via'!$G$10),MONTH('Proposta 1 Via'!$G$10),DAY(Meses!$B$1))=Meses!A274,0,IF(Meses!A274<'Proposta 1 Via'!$G$10,\"\",B273+1))","v":90}]
["2029-04-01",{"$f":"+IF(DATE(YEAR('Proposta 1 Via'!$G$10),MONTH('Proposta 1 Via'!$G$10),DAY(Meses!$B$1))=Meses!A275,0,IF(Meses!A275<'Proposta 1 Via'!$G$10,\"\",B274+1))","v":91}]
["2029-05-01",{"$f":"+IF(DATE(YEAR('Proposta 1 Via'!$G$10),MONTH('Proposta 1 Via'!$G$10),DAY(Meses!$B$1))=Meses!A276,0,IF(Meses!A276<'Proposta 1 Via'!$G$10,\"\",B275+1))","v":92}]
["2029-06-01",{"$f":"+IF(DATE(YEAR('Proposta 1 Via'!$G$10),MONTH('Proposta 1 Via'!$G$10),DAY(Meses!$B$1))=Meses!A277,0,IF(Meses!A277<'Proposta 1 Via'!$G$10,\"\",B276+1))","v":93}]
["2029-07-01",{"$f":"+IF(DATE(YEAR('Proposta 1 Via'!$G$10),MONTH('Proposta 1 Via'!$G$10),DAY(Meses!$B$1))=Meses!A278,0,IF(Meses!A278<'Proposta 1 Via'!$G$10,\"\",B277+1))","v":94}]
["2029-08-01",{"$f":"+IF(DATE(YEAR('Proposta 1 Via'!$G$10),MONTH('Proposta 1 Via'!$G$10),DAY(Meses!$B$1))=Meses!A279,0,IF(Meses!A279<'Proposta 1 Via'!$G$10,\"\",B278+1))","v":95}]
["2029-09-01",{"$f":"+IF(DATE(YEAR('Proposta 1 Via'!$G$10),MONTH('Proposta 1 Via'!$G$10),DAY(Meses!$B$1))=Meses!A280,0,IF(Meses!A280<'Proposta 1 Via'!$G$10,\"\",B279+1))","v":96}]
["2029-10-01",{"$f":"+IF(DATE(YEAR('Proposta 1 Via'!$G$10),MONTH('Proposta 1 Via'!$G$10),DAY(Meses!$B$1))=Meses!A281,0,IF(Meses!A281<'Proposta 1 Via'!$G$10,\"\",B280+1))","v":97}]
["2029-11-01",{"$f":"+IF(DATE(YEAR('Proposta 1 Via'!$G$10),MONTH('Proposta 1 Via'!$G$10),DAY(Meses!$B$1))=Meses!A282,0,IF(Meses!A282<'Proposta 1 Via'!$G$10,\"\",B281+1))","v":98}]
["2029-12-01",{"$f":"+IF(DATE(YEAR('Proposta 1 Via'!$G$10),MONTH('Proposta 1 Via'!$G$10),DAY(Meses!$B$1))=Meses!A283,0,IF(Meses!A283<'Proposta 1 Via'!$G$10,\"\",B282+1))","v":99}]
["2030-01-01",{"$f":"+IF(DATE(YEAR('Proposta 1 Via'!$G$10),MONTH('Proposta 1 Via'!$G$10),DAY(Meses!$B$1))=Meses!A284,0,IF(Meses!A284<'Proposta 1 Via'!$G$10,\"\",B283+1))","v":100}]
["2030-02-01",{"$f":"+IF(DATE(YEAR('Proposta 1 Via'!$G$10),MONTH('Proposta 1 Via'!$G$10),DAY(Meses!$B$1))=Meses!A285,0,IF(Meses!A285<'Proposta 1 Via'!$G$10,\"\",B284+1))","v":101}]
["2030-03-01",{"$f":"+IF(DATE(YEAR('Proposta 1 Via'!$G$10),MONTH('Proposta 1 Via'!$G$10),DAY(Meses!$B$1))=Meses!A286,0,IF(Meses!A286<'Proposta 1 Via'!$G$10,\"\",B285+1))","v":102}]
["2030-04-01",{"$f":"+IF(DATE(YEAR('Proposta 1 Via'!$G$10),MONTH('Proposta 1 Via'!$G$10),DAY(Meses!$B$1))=Meses!A287,0,IF(Meses!A287<'Proposta 1 Via'!$G$10,\"\",B286+1))","v":103}]
["2030-05-01",{"$f":"+IF(DATE(YEAR('Proposta 1 Via'!$G$10),MONTH('Proposta 1 Via'!$G$10),DAY(Meses!$B$1))=Meses!A288,0,IF(Meses!A288<'Proposta 1 Via'!$G$10,\"\",B287+1))","v":104}]
["2030-06-01",{"$f":"+IF(DATE(YEAR('Proposta 1 Via'!$G$10),MONTH('Proposta 1 Via'!$G$10),DAY(Meses!$B$1))=Meses!A289,0,IF(Meses!A289<'Proposta 1 Via'!$G$10,\"\",B288+1))","v":105}]
["2030-07-01",{"$f":"+IF(DATE(YEAR('Proposta 1 Via'!$G$10),MONTH('Proposta 1 Via'!$G$10),DAY(Meses!$B$1))=Meses!A290,0,IF(Meses!A290<'Proposta 1 Via'!$G$10,\"\",B289+1))","v":106}]
["2030-08-01",{"$f":"+IF(DATE(YEAR('Proposta 1 Via'!$G$10),MONTH('Proposta 1 Via'!$G$10),DAY(Meses!$B$1))=Meses!A291,0,IF(Meses!A291<'Proposta 1 Via'!$G$10,\"\",B290+1))","v":107}]
["2030-09-01",{"$f":"+IF(DATE(YEAR('Proposta 1 Via'!$G$10),MONTH('Proposta 1 Via'!$G$10),DAY(Meses!$B$1))=Meses!A292,0,IF(Meses!A292<'Proposta 1 Via'!$G$10,\"\",B291+1))","v":108}]
["2030-10-01",{"$f":"+IF(DATE(YEAR('Proposta 1 Via'!$G$10),MONTH('Proposta 1 Via'!$G$10),DAY(Meses!$B$1))=Meses!A293,0,IF(Meses!A293<'Proposta 1 Via'!$G$10,\"\",B292+1))","v":109}]
["2030-11-01",{"$f":"+IF(DATE(YEAR('Proposta 1 Via'!$G$10),MONTH('Proposta 1 Via'!$G$10),DAY(Meses!$B$1))=Meses!A294,0,IF(Meses!A294<'Proposta 1 Via'!$G$10,\"\",B293+1))","v":110}]
["2030-12-01",{"$f":"+IF(DATE(YEAR('Proposta 1 Via'!$G$10),MONTH('Proposta 1 Via'!$G$10),DAY(Meses!$B$1))=Meses!A295,0,IF(Meses!A295<'Proposta 1 Via'!$G$10,\"\",B294+1))","v":111}]
["2031-01-01",{"$f":"+IF(DATE(YEAR('Proposta 1 Via'!$G$10),MONTH('Proposta 1 Via'!$G$10),DAY(Meses!$B$1))=Meses!A296,0,IF(Meses!A296<'Proposta 1 Via'!$G$10,\"\",B295+1))","v":112}]
["2031-02-01",{"$f":"+IF(DATE(YEAR('Proposta 1 Via'!$G$10),MONTH('Proposta 1 Via'!$G$10),DAY(Meses!$B$1))=Meses!A297,0,IF(Meses!A297<'Proposta 1 Via'!$G$10,\"\",B296+1))","v":113}]
["2031-03-01",{"$f":"+IF(DATE(YEAR('Proposta 1 Via'!$G$10),MONTH('Proposta 1 Via'!$G$10),DAY(Meses!$B$1))=Meses!A298,0,IF(Meses!A298<'Proposta 1 Via'!$G$10,\"\",B297+1))","v":114}]
["2031-04-01",{"$f":"+IF(DATE(YEAR('Proposta 1 Via'!$G$10),MONTH('Proposta 1 Via'!$G$10),DAY(Meses!$B$1))=Meses!A299,0,IF(Meses!A299<'Proposta 1 Via'!$G$10,\"\",B298+1))","v":115}]
["2031-05-01",{"$f":"+IF(DATE(YEAR('Proposta 1 Via'!$G$10),MONTH('Proposta 1 Via'!$G$10),DAY(Meses!$B$1))=Meses!A300,0,IF(Meses!A300<'Proposta 1 Via'!$G$10,\"\",B299+1))","v":116}]
["2031-06-01",{"$f":"+IF(DATE(YEAR('Proposta 1 Via'!$G$10),MONTH('Proposta 1 Via'!$G$10),DAY(Meses!$B$1))=Meses!A301,0,IF(Meses!A301<'Proposta 1 Via'!$G$10,\"\",B300+1))","v":117}]
["2031-07-01",{"$f":"+IF(DATE(YEAR('Proposta 1 Via'!$G$10),MONTH('Proposta 1 Via'!$G$10),DAY(Meses!$B$1))=Meses!A302,0,IF(Meses!A302<'Proposta 1 Via'!$G$10,\"\",B301+1))","v":118}]
["2031-08-01",{"$f":"+IF(DATE(YEAR('Proposta 1 Via'!$G$10),MONTH('Proposta 1 Via'!$G$10),DAY(Meses!$B$1))=Meses!A303,0,IF(Meses!A303<'Proposta 1 Via'!$G$10,\"\",B302+1))","v":119}]
["2031-09-01",{"$f":"+IF(DATE(YEAR('Proposta 1 Via'!$G$10),MONTH('Proposta 1 Via'!$G$10),DAY(Meses!$B$1))=Meses!A304,0,IF(Meses!A304<'Proposta 1 Via'!$G$10,\"\",B303+1))","v":120}]
["2031-10-01",{"$f":"+IF(DATE(YEAR('Proposta 1 Via'!$G$10),MONTH('Proposta 1 Via'!$G$10),DAY(Meses!$B$1))=Meses!A305,0,IF(Meses!A305<'Proposta 1 Via'!$G$10,\"\",B304+1))","v":121}]
["2031-11-01",{"$f":"+IF(DATE(YEAR('Proposta 1 Via'!$G$10),MONTH('Proposta 1 Via'!$G$10),DAY(Meses!$B$1))=Meses!A306,0,IF(Meses!A306<'Proposta 1 Via'!$G$10,\"\",B305+1))","v":122}]
["2031-11-01",{"$f":"+IF(DATE(YEAR('Proposta 1 Via'!$G$10),MONTH('Proposta 1 Via'!$G$10),DAY(Meses!$B$1))=Meses!A307,0,IF(Meses!A307<'Proposta 1 Via'!$G$10,\"\",B306+1))","v":123}]

{"sheet":"fluxos","index":5,"n_rows":52,"n_cols":25,"rows_kept":52,"cut":false,"hidden":true,"merged":[[0,16,0,19],[0,21,0,24],[3,4,5,4],[0,6,0,9],[0,11,0,14],[0,1,0,4],[3,9,5,9]]}
[null,{"$f":"+'DADOS DOS EMPREENDIMENTOS'!O4","v":"Completo Guanabara - Premio Volta Caixa"},null,null,null,null,{"$f":"+'DADOS DOS EMPREENDIMENTOS'!T4","v":"Completo Guanabara - Desconto - Sem Premio"},null,null,null,null,{"$f":"+'DADOS DOS EMPREENDIMENTOS'!Y4","v":0},null,null,null,null,{"$f":"+'DADOS DOS EMPREENDIMENTOS'!AD4","v":0},null,null,null,null,{"$f":"+'DADOS DOS EMPREENDIMENTOS'!AI4","v":0}]
[null,{"$f":"CONCATENATE($B$1,B3)","v":"Completo Guanabara - Premio Volta CaixaMÊS DE INÍCIO"},{"$f":"CONCATENATE($B$1,C3)","v":"Completo Guanabara - Premio Volta CaixaQTDE PARCELAS"},{"$f":"CONCATENATE($B$1,D3)","v":"Completo Guanabara - Premio Volta Caixa% FLUXO"},{"$f":"CONCATENATE($B$1,E3)","v":"Completo Guanabara - Premio Volta CaixaTOTAL"},null,{"$f":"CONCATENATE($G$1,G3)","v":"Completo Guanabara - Desconto - Sem PremioMÊS DE INÍCIO"},{"$f":"CONCATENATE($G$1,H3)","v":"Completo Guanabara - Desconto - Sem PremioQTDE PARCELAS"},{"$f":"CONCATENATE($G$1,I3)","v":"Completo Guanabara - Desconto - Sem Premio% FLUXO"},{"$f":"CONCATENATE($G$1,J3)","v":"Completo Guanabara - Desconto - Sem PremioTOTAL"},null,{"$f":"CONCATENATE($L$1,L3)","v":"0MÊS DE INÍCIO"},{"$f":"CONCATENATE($L$1,M3)","v":"0QTDE PARCELAS"},{"$f":"CONCATENATE($L$1,N3)","v":"0% FLUXO"},{"$f":"CONCATENATE($L$1,O3)","v":"0TOTAL"},null,{"$f":"CONCATENATE($Q$1,Q3)","v":"0MÊS DE INÍCIO"},{"$f":"CONCATENATE($Q$1,R3)","v":"0QTDE PARCELAS"},{"$f":"CONCATENATE($Q$1,S3)","v":"0% FLUXO"},{"$f":"CONCATENATE($Q$1,T3)","v":"0TOTAL"},null,{"$f":"CONCATENATE($V$1,V3)","v":"0MÊS DE INÍCIO"},{"$f":"CONCATENATE($V$1,W3)","v":"0QTDE PARCELAS"},{"$f":"CONCATENATE($V$1,X3)","v":"0% FLUXO"},{"$f":"CONCATENATE($V$1,Y3)","v":"0TOTAL"}]
[null,"MÊS DE INÍCIO","QTDE PARCELAS","% FLUXO","TOTAL",null,"MÊS DE INÍCIO","QTDE PARCELAS","% FLUXO","TOTAL",null,"MÊS DE INÍCIO","QTDE PARCELAS","% FLUXO","TOTAL",null,"MÊS DE INÍCIO","QTDE PARCELAS","% FLUXO","TOTAL",null,"MÊS DE INÍCIO","QTDE PARCELAS","% FLUXO","TOTAL"]
["Entrada",0,1,{"$f":"5.5%/4","v":1.375E-2},"Entrada",null,0,1,{"$f":"5.5%/4","v":1.375E-2},"Entrada"]
["Entrada",1,1,{"$f":"5.5%/4","v":1.375E-2},null,null,1,1,{"$f":"5.5%/4","v":1.375E-2}]
["Entrada",2,2,{"$f":"5.5%/4*2","v":2.75E-2},null,null,2,2,{"$f":"5.5%/4*2","v":2.75E-2}]
["Anual",15,2,0.01,"Pró Soluto",null,15,2,0.01,"Pró Soluto"]
["Mensal 1",4,2,{"$f":"2.5%/25*3","v":3.0000000000000001E-3},"Antes Repasse",null,4,2,{"$f":"2.5%/25*3","v":3.0000000000000001E-3},"Antes Repasse"]
["Mensal 2",6,9,{"$f":"2.5%/25*9","v":9.0000000000000011E-3},null,null,6,9,{"$f":"2.5%/25*9","v":9.0000000000000011E-3}]
["Mensal 3",15,7,{"$f":"2.5%/25*7","v":7.0000000000000001E-3},null,null,15,7,{"$f":"2.5%/25*7","v":7.0000000000000001E-3}]
["Mensal 4",22,6,{"$f":"2.5%/25*6","v":6.0000000000000001E-3},null,null,22,6,{"$f":"2.5%/25*6","v":6.0000000000000001E-3}]
["Chaves",28,1,0.01,null,null,28,1,0.01]
["Repasse",3,1,0.9,"Repasse",null,3,1,0.9,"Repasse"]
[null,0,0,0,null,null,0,0,0]
[null,0,0,0,null,null,0,0,0]
[null,null,null,{"$f":"SUM(D4:D15)","v":1},null,null,null,null,{"$f":"SUM(I4:I15)","v":1},null,null,null,null,{"$f":"SUM(N4:N15)","v":0}]
[null,null,null,null,null,{"$f":"6+8","v":14},null,8]
[]
[null,null,null,null,null,{"$f":"5.5%/29","v":1.8965517241379311E-3},null,{"$f":"7%/28","v":2.5000000000000001E-3},null,{"$f":"9.3%/27","v":3.4444444444444449E-3}]
[null,null,null,2.90625E-3,{"$f":"SUM(F19:F20)","v":3.7931034482758621E-3},1.8965517241379311E-3,{"$f":"9.3%/32","v":2.9062500000000004E-3}]
[null,null,null,2.90625E-3,null,1.8965517241379311E-3,{"$f":"5.5%/28","v":1.9642857142857144E-3},{"$f":"9.3%/27","v":3.4444444444444449E-3},{"$f":"H21*C11","v":2.066666666666667E-2}]
[null,null,null,2.90625E-3,null,1.8965517241379311E-3,1.9642857142857144E-3]
[null,null,null,2.90625E-3,null,1.8965517241379311E-3,1.9642857142857144E-3]
[null,null,null,2.90625E-3,null,1.8965517241379311E-3,1.9642857142857144E-3]
[null,null,null,2.90625E-3,null,{"$f":"SUM(F19:F24)","v":1.1379310344827587E-2},1.9642857142857144E-3]
[null,null,null,2.90625E-3,null,null,1.9642857142857144E-3]
[null,null,null,2.90625E-3,null,null,1.9642857142857144E-3]
[null,null,null,2.90625E-3,null,null,1.9642857142857144E-3]
[null,null,null,2.90625E-3,null,null,1.9642857142857144E-3]
[null,null,null,2.90625E-3,null,null,1.9642857142857144E-3]
[null,null,null,2.90625E-3,null,null,1.9642857142857144E-3]
[null,null,null,2.90625E-3,null,null,1.9642857142857144E-3]
[null,null,null,2.90625E-3,null,null,1.9642857142857144E-3]
[null,null,null,2.90625E-3,null,null,1.9642857142857144E-3]
[null,null,null,2.90625E-3,null,null,1.9642857142857144E-3]
[null,null,null,2.90625E-3,null,null,1.9642857142857144E-3]
[null,null,null,2.90625E-3,null,null,1.9642857142857144E-3]
[null,null,null,2.90625E-3,null,null,1.9642857142857144E-3]
[null,null,null,2.90625E-3,null,null,1.9642857142857144E-3]
[null,null,null,2.90625E-3,null,null,1.9642857142857144E-3]
[null,null,null,2.90625E-3,null,null,1.9642857142857144E-3]
[null,null,null,2.90625E-3,null,null,1.9642857142857144E-3]
[null,null,null,2.90625E-3,null,null,1.9642857142857144E-3]
[null,null,null,2.90625E-3,null,null,1.9642857142857144E-3]
[null,null,null,2.90625E-3,null,null,1.9642857142857144E-3]
[null,null,null,2.90625E-3,null,null,1.9642857142857144E-3]
[null,null,null,2.90625E-3,null,null,{"$f":"SUM(G19:G46)","v":5.3977678571428593E-2}]
[null,null,null,2.90625E-3]
[null,null,null,2.90625E-3]
[null,null,null,2.90625E-3]
[]
[null,null,null,9.0093749999999986E-2]

{"sheet":"DADOS DOS EMPREENDIMENTOS","index":6,"n_rows":206,"n_cols":137,"rows_kept":206,"cut":false,"hidden":true,"merged":[[5,49,5,52],[5,54,5,57],[5,74,5,77],[5,84,5,87],[5,69,5,72],[5,59,5,62],[2,14,2,17],[2,19,2,22],[2,24,2,27],[2,69,2,72],[2,29,2,32],[2,34,2,37],[2,39,2,42],[2,59,2,62],[2,44,2,47],[2,49,2,52],[2,54,2,57],[2,64,2,67],[2,84,2,87],[5,64,5,67],[5,79,5,82],[6,84,6,87],[6,64,6,67],[2,74,2,77],[2,79,2,82],[6,49,6,52],[6,54,6,57],[6,79,6,82],[6,69,6,72],[6,74,6,77],[6,59,6,62],[5,39,5,42],[5,44,5,47],[5,34,5,37],[6,44,6,47],[6,34,6,37],[6,39,6,42],[7,0,8,2],[7,9,8,9],[7,10,8,10],[6,14,6,17],[5,29,5,32],[6,29,6,32],[5,14,5,17],[5,19,5,22],[6,19,6,22],[5,24,5,27],[6,24,6,27]]}
[null,null,null,null,null,null,null,null,null,null,null,null,null,null,1,2,3,4,5,6,7,8,9,10,11,12,13,14,15,16,17,18,19,20,21,22,23,24,25,26,27,28,29,30,31,32,33,34,35,36,37,38,39,40,41,42,43,44,45,46,47,48,49,50,51,52,53,54,55,56,57,58,59,60,61,62,63,64,65,66,67,68,69,70,71,72,73,74,75,76,77,78,79,80,81,82,83,84,85,86,87,88,89,90,91,92,93,94,95,96,97,98,99,100,101,102,103,104,105,106,107,108,109,110,111,112,113,114,115,116,117,118,119,120,121,122,123]
[]
[null,null,null,null,null,null,null,null,null,null,null,null,null,null,"Empreendimento 01",null,null,null,null,"Empreendimento 02",null,null,null,null,"Empreendimento 03",null,null,null,null,"Empreendimento 04",null,null,null,null,"Empreendimento 05",null,null,null,null,"Empreendimento 06",null,null,null,null,"Empreendimento 07",null,null,null,null,"Empreendimento 08",null,null,null,null,"Empreendimento 09",null,null,null,null,"Empreendimento 10",null,null,null,null,"Empreendimento 11",null,null,null,null,"Empreendimento 12",null,null,null,null,"Empreendimento 13",null,null,null,null,"Empreendimento 14"]
[null,null,null,null,null,null,null,null,null,null,null,null,null,null,"Completo Guanabara - Premio Volta Caixa",null,null,null,null,"Completo Guanabara - Desconto - Sem Premio"]
[]
[null,null,1,2,3,4,5,6,7,8,9,10,11,12,"Qual o Valor Máximo do Imóvel no Pacote para esta região?",null,null,null,null,"Qual o Valor Máximo do Imóvel no Pacote para esta região?",null,null,null,null,"Qual o Valor Máximo do Imóvel no Pacote para esta região?",null,null,null,null,"Qual o Valor Máximo do Imóvel no Pacote para esta região?",null,null,null,null,"Qual o Valor Máximo do Imóvel no Pacote para esta região?",null,null,null,null,"Qual o Valor Máximo do Imóvel no Pacote para esta região?",null,null,null,null,"Qual o Valor Máximo do Imóvel no Pacote para esta região?",null,null,null,null,"Qual o Valor Máximo do Imóvel no Pacote para esta região?",null,null,null,null,"Qual o Valor Máximo do Imóvel no Pacote para esta região?",null,null,null,null,"Qual o Valor Máximo do Imóvel no Pacote para esta região?",null,null,null,null,"Qual o Valor Máximo do Imóvel no Pacote para esta região?",null,null,null,null,"Qual o Valor Máximo do Imóvel no Pacote para esta região?",null,null,null,null,"Qual o Valor Máximo do Imóvel no Pacote para esta região?",null,null,null,null,"Qual o Valor Máximo do Imóvel no Pacote para esta região?"]
[1,2,3,4,5,6,7,8,9,10,11,12,null,null,240000,null,null,null,null,190000,null,null,null,null,190000,null,null,null,null,190000,null,null,null,null,170000,null,null,null,null,170000,null,null,null,null,170000,null,null,null,null,130000,null,null,null,null,130000,null,null,null,null,130000,null,null,null,null,130000,null,null,null,null,130000,null,null,null,null,130000,null,null,null,null,130000]
["Código dos dos empreendimentos",null,null,"Obra",null,"Venda",null,null,null,{"$f":"P9","v":"Prazo Para Chaves"},"Data Das Chaves","Repasse","Período Atual","Repasse"]
[null,null,null,"Código Curva Obra","Código Desembolso","Código Tipo","Código Preço de Venda","Código Avaliação CAIXA","Valor Máximo do Pacote",null,null,null,null,null,null,"Prazo Para Chaves","Data Chaves",null,null,null,"Prazo Para Chaves","Data Chaves",null,null,null,"Prazo Para Chaves","Data Chaves",null,null,null,"Prazo Para Chaves","Data Chaves",null,null,null,"Prazo Para Chaves","Data Chaves",null,null,null,"Prazo Para Chaves","Data Chaves",null,null,null,"Prazo Para Chaves","Data Chaves",null,null,null,"Prazo Para Chaves","Data Chaves",null,null,null,"Prazo Para Chaves","Data Chaves",null,null,null,"Prazo Para Chaves","Data Chaves",null,null,null,"Prazo Para Chaves","Data Chaves",null,null,null,"Prazo Para Chaves","Data Chaves",null,null,null,"Prazo Para Chaves","Data Chaves",null,null,null,"Mês de Chaves","Data Chaves"]
[1,{"$f":"O4","v":"Completo Guanabara - Premio Volta Caixa"},1,3,{"$f":"D10+1","v":4},2,3,{"$f":"4","v":4},{"$f":"O7","v":240000},{"$f":"P10","v":28},{"$f":"Q10","v":"2024-01-10"},null,{"$f":"O14","v":0},5,null,28,"2024-01-10",null,null,null,31,"2024-01-10",null,null,null,null,null,null,null,null,null,null,null,null,null,{"$f":"AE10","v":0}]
[2,{"$f":"T4","v":"Completo Guanabara - Desconto - Sem Premio"},2,{"$f":"D10+5","v":8},{"$f":"D11+1","v":9},{"$f":"F10+5","v":7},{"$f":"G10+5","v":8},{"$f":"H10+5","v":9},{"$f":"T7","v":190000},{"$f":"U10","v":31},{"$f":"VP","v":"2024-01-10"},null,{"$f":"W10","v":0},{"$f":"N10+5","v":10}]
[3,{"$f":"Y4","v":0},3,{"$f":"D11+5","v":13},14,{"$f":"F11+5","v":12},{"$f":"G11+5","v":13},{"$f":"H11+5","v":14},{"$f":"Y7","v":190000},{"$f":"Z10","v":0},{"$f":"AA10","v":"00:00:00"},null,{"$f":"AB10","v":0},15,null,"Desconto ",null,null,null,null,"Desconto ",null,null,null,null,"Desconto "]
[4,{"$f":"AD4","v":0},4,18,19,17,18,19,{"$f":"AD7","v":190000},{"$f":"AE10","v":0},{"$f":"AF10","v":"00:00:00"},null,{"$f":"AG10","v":0},20,null,0,null,null,null,null,0,null,null,null,null,0]
[5,{"$f":"AI4","v":0},5,23,24,22,23,24,{"$f":"AI7","v":170000},{"$f":"AJ10","v":0},{"$f":"AK10","v":"00:00:00"},null,{"$f":"AL10","v":0},25,null,null,null,133990]
[6,{"$f":"AN4","v":0},6,28,29,27,28,29,{"$f":"AN7","v":170000},{"$f":"AO10","v":0},{"$f":"AP10","v":"00:00:00"},null,{"$f":"AQ10","v":0},30,null,"Tipo","Preço de Venda","Avaliação CAIXA","Repasse",null,"Tipo","Preço de Venda","Avaliação CAIXA","Repasse",null,"Tipo","Preço de Venda","Avaliação CAIXA","Repasse",null,"Tipo","Preço de Venda","Avaliação CAIXA","Repasse",null,"Tipo","Preço de Venda","Avaliação CAIXA","Repasse",null,"Tipo","Preço de Venda","Avaliação CAIXA","Repasse",null,"Tipo","Preço de Venda","Avaliação CAIXA","Repasse",null,"Tipo","Preço de Venda","Avaliação CAIXA","Repasse",null,"Tipo","Preço de Venda","Avaliação CAIXA","Repasse",null,"Tipo","Preço de Venda","Avaliação CAIXA","Repasse",null,"Tipo","Preço de Venda","Avaliação CAIXA","Repasse",null,"Tipo","Preço de Venda","Avaliação CAIXA","Repasse",null,"Tipo","Preço de Venda","Avaliação CAIXA","Repasse",null,"Tipo","Preço de Venda","Avaliação CAIXA","Repasse"]
[7,{"$f":"AS4","v":0},7,33,34,32,33,34,{"$f":"AS7","v":170000},{"$f":"AT10","v":0},{"$f":"AU10","v":"00:00:00"},null,{"$f":"AV10","v":0},35,1,"5° andar S/ Vaga",159390,158000,3,1,"5° andar S/ Vaga",157390,158000,3,1,null,null,null,null,1,null,null,null,null,1,null,null,null,null,1,null,null,null,null,1,null,null,null,null,1,null,null,null,null,1,null,null,null,null,1,null,null,null,null,1,null,null,null,null,1,null,null,null,null,1,null,null,null,null,1]
[null,null,null,null,null,null,null,null,null,null,null,null,null,null,2,"4° andar S/ Vaga",161390,158000,3,null,"4° andar S/ Vaga",159390,158000,3]
[8,{"$f":"AX4","v":0},8,{"$f":"D16+5","v":38},39,{"$f":"F16+5","v":37},{"$f":"G16+5","v":38},{"$f":"H16+5","v":39},{"$f":"AX7","v":130000},{"$f":"AY10","v":0},{"$f":"AZ10","v":"00:00:00"},null,{"$f":"BA10","v":0},{"$f":"N16+5","v":40},3,"4° andar C/ Vaga",175390,172000,3,2,"4° andar C/ Vaga",173390,172000,3,2,null,null,null,null,2,null,null,null,null,2,null,null,null,null,2,null,null,null,null,2,null,null,null,null,2,null,null,null,null,2,null,null,null,null,2,null,null,null,null,2,null,null,null,null,2,null,null,null,null,2,null,null,null,null,2]
[9,{"$f":"BC4","v":0},9,43,44,42,43,44,{"$f":"BC7","v":130000},{"$f":"BD10","v":0},{"$f":"BE10","v":"00:00:00"},null,{"$f":"BF10","v":0},{"$f":"N18+5","v":45},4,"3°andar C/ Vaga",175390,178000,3,3,"3°andar C/ Vaga",173390,178000,3,3,null,null,null,null,3,null,null,null,null,3,null,null,null,null,3,null,null,null,null,3,null,null,null,null,3,null,null,null,null,3,null,null,null,null,3,null,null,null,null,3,null,null,null,null,3,null,null,null,null,3,null,null,null,null,3]
[null,null,null,null,null,null,null,null,null,null,null,null,null,null,5,"2°andar C/ Vaga",176390,178000,3,null,"2°andar C/ Vaga",174390,178000,3]
[null,null,null,null,null,null,null,null,null,null,null,null,null,null,6,"1° andar S/ Vaga",160390,151000,1,null,"1° andar S/ Vaga",158390,151000,1]
[10,{"$f":"BH4","v":0},10,{"$f":"D19+5","v":48},49,{"$f":"F19+5","v":47},{"$f":"G19+5","v":48},{"$f":"H19+5","v":49},{"$f":"BH7","v":130000},{"$f":"BI10","v":0},{"$f":"BJ10","v":"00:00:00"},null,{"$f":"BK10","v":0},{"$f":"N19+5","v":50},7,"1° andar C/ Vaga",174390,179000,3,4,"1° andar C/ Vaga",172390,179000,3,4,null,null,null,null,4,null,null,null,null,4,null,null,null,null,4,null,null,null,null,4,null,null,null,null,4,null,null,null,null,4,null,null,null,null,4,null,null,null,null,4,null,null,null,null,4,null,null,null,null,4,null,null,null,null,4]
[null,null,null,null,null,null,null,null,null,null,null,null,null,null,8,"1º andar 1 Quarto (PNE)",164390,171000,3,null,"1º andar 1 Quarto (PNE)",162390,171000,3]
[11,{"$f":"BM4","v":0},11,{"$f":"D22+5","v":53},54,{"$f":"F22+5","v":52},{"$f":"G22+5","v":53},{"$f":"H22+5","v":54},{"$f":"BM7","v":130000},{"$f":"BN10","v":0},{"$f":"BO10","v":"00:00:00"},null,{"$f":"BP10","v":0},{"$f":"N22+5","v":55},9,null,null,null,null,5,null,null,null,null,5,null,null,null,null,5,null,null,null,null,5,null,null,null,null,5,null,null,null,null,5,null,null,null,null,5,null,null,null,null,5,null,null,null,null,5,null,null,null,null,5,null,null,null,null,5,null,null,null,null,5,null,null,null,null,5]
[null,null,null,null,null,null,null,null,null,null,null,null,null,null,10]
[12,{"$f":"BR4","v":0},12,{"$f":"D24+5","v":58},59,{"$f":"F24+5","v":57},{"$f":"G24+5","v":58},{"$f":"H24+5","v":59},{"$f":"BR7","v":130000},{"$f":"BS10","v":0},{"$f":"BT10","v":"00:00:00"},null,{"$f":"BU10","v":0},{"$f":"N24+5","v":60},11,null,null,null,null,6,null,null,null,null,6,null,null,null,null,6,null,null,null,null,6,null,null,null,null,6,null,null,null,null,6,null,null,null,null,6,null,null,null,null,6,null,null,null,null,6,null,null,null,null,6,null,null,null,null,6,null,null,null,null,6,null,null,null,null,6]
[13,{"$f":"BW4","v":0},13,63,64,62,63,64,{"$f":"BW7","v":130000},{"$f":"BX10","v":0},{"$f":"BY10","v":"00:00:00"},null,{"$f":"BZ10","v":0},{"$f":"N26+5","v":65},12,null,null,null,null,7,null,null,null,null,7,null,null,null,null,7,null,null,null,null,7,null,null,null,null,7,null,null,null,null,7,null,null,null,null,7,null,null,null,null,7,null,null,null,null,7,null,null,null,null,7,null,null,null,null,7,null,null,null,null,7,null,null,null,null,7]
[14,{"$f":"CB4","v":0},14,68,69,67,68,69,{"$f":"CB7","v":130000},{"$f":"CC10","v":0},{"$f":"CD10","v":"00:00:00"},null,{"$f":"CE10","v":0},{"$f":"N27+5","v":70},null,null,null,null,null,8,null,null,null,null,8,null,null,null,null,8,null,null,null,null,8,null,null,null,null,8,null,null,null,null,8,null,null,null,null,8,null,null,null,null,8,null,null,null,null,8,null,null,null,null,8,null,null,null,null,8,null,null,null,null,8,null,null,null,null,8]
[null,null,null,null,null,null,null,null,null,null,null,null,null,null,null,null,null,null,null,9,null,null,null,null,9,null,null,null,null,9,null,null,null,null,9,null,null,null,null,9,null,null,null,null,9,null,null,null,null,9,null,null,null,null,9,null,null,null,null,9,null,null,null,null,9,null,null,null,null,9,null,null,null,null,9,null,null,null,null,9]
[null,null,null,null,null,null,null,null,null,null,null,null,null,null,null,null,null,null,null,10,null,null,null,null,10,null,null,null,null,10,null,null,null,null,10,null,null,null,null,10,null,null,null,null,10,null,null,null,null,10,null,null,null,null,10,null,null,null,null,10,null,null,null,null,10,null,null,null,null,10,null,null,null,null,10,null,null,null,null,10]
[null,null,null,null,null,null,null,null,null,null,null,null,null,null,null,null,null,null,null,11,null,null,null,null,11,null,null,null,null,11,null,null,null,null,11,null,null,null,null,11,null,null,null,null,11,null,null,null,null,11,null,null,null,null,11,null,null,null,null,11,null,null,null,null,11,null,null,null,null,11,null,null,null,null,11,null,null,null,null,11]
[null,null,null,null,null,null,null,null,null,null,null,null,null,null,null,null,null,null,null,12,null,null,null,null,12,null,null,null,null,12,null,null,null,null,12,null,null,null,null,12,null,null,null,null,12,null,null,null,null,12,null,null,null,null,12,null,null,null,null,12,null,null,null,null,12,null,null,null,null,12,null,null,null,null,12,null,null,null,null,12]
[null,null,null,null,null,null,null,null,null,null,null,null,null,null,null,null,null,null,null,13,null,null,null,null,13,null,null,null,null,13,null,null,null,null,13,null,null,null,null,13,null,null,null,null,13,null,null,null,null,13,null,null,null,null,13,null,null,null,null,13,null,null,null,null,13,null,null,null,null,13,null,null,null,null,13,null,null,null,null,13]
[null,null,null,null,null,null,null,null,null,null,null,null,null,null,null,null,null,null,null,14,null,null,null,null,14,null,null,null,null,14,null,null,null,null,14,null,null,null,null,14,null,null,null,null,14,null,null,null,null,14,null,null,null,null,14,null,null,null,null,14,null,null,null,null,14,null,null,null,null,14,null,null,null,null,14,null,null,null,null,14]
[null,null,null,null,null,null,null,null,null,null,null,null,null,null,null,null,null,null,null,15,null,null,null,null,15,null,null,null,null,15,null,null,null,null,15,null,null,null,null,15,null,null,null,null,15,null,null,null,null,15,null,null,null,null,15,null,null,null,null,15,null,null,null,null,15,null,null,null,null,15,null,null,null,null,15,null,null,null,null,15]
[null,null,null,null,null,null,null,null,null,null,null,null,null,null,null,null,null,null,null,16,null,null,null,null,16,null,null,null,null,16,null,null,null,null,16,null,null,null,null,16,null,null,null,null,16,null,null,null,null,16,null,null,null,null,16,null,null,null,null,16,null,null,null,null,16,null,null,null,null,16,null,null,null,null,16,null,null,null,null,16]
[null,null,null,"Valor Máximo do imóvel no Pacote",null,null,null,null,null,null,null,null,null,null,null,null,null,null,null,17,null,null,null,null,17,null,null,null,null,17,null,null,null,null,17,null,null,null,null,17,null,null,null,null,17,null,null,null,null,17,null,null,null,null,17,null,null,null,null,17,null,null,null,null,17,null,null,null,null,17,null,null,null,null,17,null,null,null,null,17]
[null,null,null,190000,null,null,null,null,null,null,null,null,null,null,null,null,null,null,null,18,null,null,null,null,18,null,null,null,null,18,null,null,null,null,18,null,null,null,null,18,null,null,null,null,18,null,null,null,null,18,null,null,null,null,18,null,null,null,null,18,null,null,null,null,18,null,null,null,null,18,null,null,null,null,18,null,null,null,null,18]
[null,null,null,240000,null,null,null,null,null,null,null,null,null,null,null,null,null,null,null,19,null,null,null,null,19,null,null,null,null,19,null,null,null,null,19,null,null,null,null,19,null,null,null,null,19,null,null,null,null,19,null,null,null,null,19,null,null,null,null,19,null,null,null,null,19,null,null,null,null,19,null,null,null,null,19,null,null,null,null,19]
[null,null,null,null,null,null,null,null,null,null,null,null,null,null,null,null,null,null,null,20,null,null,null,null,20,null,null,null,null,20,null,null,null,null,20,null,null,null,null,20,null,null,null,null,20,null,null,null,null,20,null,null,null,null,20,null,null,null,null,20,null,null,null,null,20,null,null,null,null,20,null,null,null,null,20,null,null,null,null,20]
[null,null,null,null,null,null,null,null,null,null,null,null,null,null,null,null,null,null,null,21,null,null,null,null,21,null,null,null,null,21,null,null,null,null,21,null,null,null,null,21,null,null,null,null,21,null,null,null,null,21,null,null,null,null,21,null,null,null,null,21,null,null,null,null,21,null,null,null,null,21,null,null,null,null,21,null,null,null,null,21]
[null,null,null,null,null,null,null,null,null,null,null,null,null,null,null,null,null,null,null,22,null,null,null,null,22,null,null,null,null,22,null,null,null,null,22,null,null,null,null,22,null,null,null,null,22,null,null,null,null,22,null,null,null,null,22,null,null,null,null,22,null,null,null,null,22,null,null,null,null,22,null,null,null,null,22,null,null,null,null,22]
[]
[]
[null,null,null,null,null,null,null,null,null,null,null,null,null,null,"Período",null,null,null,null,"Período",null,null,null,null,"Período",null,null,null,null,"Período","Data","Obra","Desembolso",null,"Período","Data","Obra","Desembolso",null,"Período","Data","Obra","Desembolso",null,"Período","Data","Obra","Desembolso",null,"Período","Data","Obra","Desembolso",null,"Período","Data","Obra","Desembolso",null,"Período","Data","Obra","Desembolso",null,"Período","Data","Obra","Desembolso",null,"Período","Data","Obra","Desembolso",null,"Período","Data","Obra","Desembolso",null,"Período","Data","Obra","Desembolso"]
[]
[null,null,null,null,null,null,null,null,null,null,null,null,null,null,1,null,null,null,null,1,null,null,null,null,1,null,null,null,null,1,"2009-06-01",0,{"$f":"IF(AD47<'DADOS DOS EMPREENDIMENTOS'!AF$11,0,IF(AD47='DADOS DOS EMPREENDIMENTOS'!AF$11,SUM(AF$46:AF47)*(1-'DADOS DOS EMPREENDIMENTOS'!#REF!-'DADOS DOS EMPREENDIMENTOS'!#REF!)+'DADOS DOS EMPREENDIMENTOS'!#REF!,IF(AD47='DADOS DOS EMPREENDIMENTOS'!#REF!,'DADOS DOS EMPREENDIMENTOS'!#REF!,AF47*(1-'DADOS DOS EMPREENDIMENTOS'!#REF!-'DADOS DOS EMPREENDIMENTOS'!#REF!))))","v":{"$error":"#REF!"}},null,1,"2009-06-01",0,{"$f":"IF(AI47<'DADOS DOS EMPREENDIMENTOS'!AK$11,0,IF(AI47='DADOS DOS EMPREENDIMENTOS'!AK$11,SUM(AK$46:AK47)*(1-'DADOS DOS EMPREENDIMENTOS'!#REF!-'DADOS DOS EMPREENDIMENTOS'!#REF!)+'DADOS DOS EMPREENDIMENTOS'!#REF!,IF(AI47='DADOS DOS EMPREENDIMENTOS'!#REF!,'DADOS DOS EMPREENDIMENTOS'!#REF!,AK47*(1-'DADOS DOS EMPREENDIMENTOS'!#REF!-'DADOS DOS EMPREENDIMENTOS'!#REF!))))","v":{"$error":"#REF!"}},null,1,"2009-06-01",0,{"$f":"IF(AN47<'DADOS DOS EMPREENDIMENTOS'!AP$11,0,IF(AN47='DADOS DOS EMPREENDIMENTOS'!AP$11,SUM(AP$46:AP47)*(1-'DADOS DOS EMPREENDIMENTOS'!#REF!-'DADOS DOS EMPREENDIMENTOS'!#REF!)+'DADOS DOS EMPREENDIMENTOS'!#REF!,IF(AN47='DADOS DOS EMPREENDIMENTOS'!#REF!,'DADOS DOS EMPREENDIMENTOS'!#REF!,AP47*(1-'DADOS DOS EMPREENDIMENTOS'!#REF!-'DADOS DOS EMPREENDIMENTOS'!#REF!))))","v":{"$error":"#REF!"}},null,1,"2009-06-01",0,{"$f":"IF(AS47<'DADOS DOS EMPREENDIMENTOS'!AU$11,0,IF(AS47='DADOS DOS EMPREENDIMENTOS'!AU$11,SUM(AU$46:AU47)*(1-'DADOS DOS EMPREENDIMENTOS'!#REF!-'DADOS DOS EMPREENDIMENTOS'!#REF!)+'DADOS DOS EMPREENDIMENTOS'!#REF!,IF(AS47='DADOS DOS EMPREENDIMENTOS'!#REF!,'DADOS DOS EMPREENDIMENTOS'!#REF!,AU47*(1-'DADOS DOS EMPREENDIMENTOS'!#REF!-'DADOS DOS EMPREENDIMENTOS'!#REF!))))","v":{"$error":"#REF!"}},null,1,"2009-06-01",0,{"$f":"IF(AX47<'DADOS DOS EMPREENDIMENTOS'!AZ$11,0,IF(AX47='DADOS DOS EMPREENDIMENTOS'!AZ$11,SUM(AZ$46:AZ47)*(1-'DADOS DOS EMPREENDIMENTOS'!#REF!-'DADOS DOS EMPREENDIMENTOS'!#REF!)+'DADOS DOS EMPREENDIMENTOS'!#REF!,IF(AX47='DADOS DOS EMPREENDIMENTOS'!#REF!,'DADOS DOS EMPREENDIMENTOS'!#REF!,AZ47*(1-'DADOS DOS EMPREENDIMENTOS'!#REF!-'DADOS DOS EMPREENDIMENTOS'!#REF!))))","v":{"$error":"#REF!"}},null,1,"2009-06-01",0,{"$f":"IF(BC47<'DADOS DOS EMPREENDIMENTOS'!BE$11,0,IF(BC47='DADOS DOS EMPREENDIMENTOS'!BE$11,SUM(BE$46:BE47)*(1-'DADOS DOS EMPREENDIMENTOS'!#REF!-'DADOS DOS EMPREENDIMENTOS'!#REF!)+'DADOS DOS EMPREENDIMENTOS'!#REF!,IF(BC47='DADOS DOS EMPREENDIMENTOS'!#REF!,'DADOS DOS EMPREENDIMENTOS'!#REF!,BE47*(1-'DADOS DOS EMPREENDIMENTOS'!#REF!-'DADOS DOS EMPREENDIMENTOS'!#REF!))))","v":{"$error":"#REF!"}},null,1,"2009-06-01",0,{"$f":"IF(BH47<'DADOS DOS EMPREENDIMENTOS'!BJ$11,0,IF(BH47='DADOS DOS EMPREENDIMENTOS'!BJ$11,SUM(BJ$46:BJ47)*(1-'DADOS DOS EMPREENDIMENTOS'!#REF!-'DADOS DOS EMPREENDIMENTOS'!#REF!)+'DADOS DOS EMPREENDIMENTOS'!#REF!,IF(BH47='DADOS DOS EMPREENDIMENTOS'!#REF!,'DADOS DOS EMPREENDIMENTOS'!#REF!,BJ47*(1-'DADOS DOS EMPREENDIMENTOS'!#REF!-'DADOS DOS EMPREENDIMENTOS'!#REF!))))","v":{"$error":"#REF!"}},null,1,"2009-06-01",0,{"$f":"IF(BM47<'DADOS DOS EMPREENDIMENTOS'!BO$11,0,IF(BM47='DADOS DOS EMPREENDIMENTOS'!BO$11,SUM(BO$46:BO47)*(1-'DADOS DOS EMPREENDIMENTOS'!#REF!-'DADOS DOS EMPREENDIMENTOS'!#REF!)+'DADOS DOS EMPREENDIMENTOS'!#REF!,IF(BM47='DADOS DOS EMPREENDIMENTOS'!BO$12,'DADOS DOS EMPREENDIMENTOS'!#REF!,BO47*(1-'DADOS DOS EMPREENDIMENTOS'!#REF!-'DADOS DOS EMPREENDIMENTOS'!#REF!))))","v":{"$error":"#REF!"}},null,1,"2009-06-01",0,{"$f":"IF(BR47<'DADOS DOS EMPREENDIMENTOS'!BT$11,0,IF(BR47='DADOS DOS EMPREENDIMENTOS'!BT$11,SUM(BT$46:BT47)*(1-'DADOS DOS EMPREENDIMENTOS'!#REF!-'DADOS DOS EMPREENDIMENTOS'!#REF!)+'DADOS DOS EMPREENDIMENTOS'!#REF!,IF(BR47='DADOS DOS EMPREENDIMENTOS'!BT$12,'DADOS DOS EMPREENDIMENTOS'!#REF!,BT47*(1-'DADOS DOS EMPREENDIMENTOS'!#REF!-'DADOS DOS EMPREENDIMENTOS'!#REF!))))","v":{"$error":"#REF!"}},null,1,"2009-06-01",0,{"$f":"IF(BW47<'DADOS DOS EMPREENDIMENTOS'!BY$11,0,IF(BW47='DADOS DOS EMPREENDIMENTOS'!BY$11,SUM(BY$46:BY47)*(1-'DADOS DOS EMPREENDIMENTOS'!#REF!-'DADOS DOS EMPREENDIMENTOS'!#REF!)+'DADOS DOS EMPREENDIMENTOS'!#REF!,IF(BW47='DADOS DOS EMPREENDIMENTOS'!BY$12,'DADOS DOS EMPREENDIMENTOS'!#REF!,BY47*(1-'DADOS DOS EMPREENDIMENTOS'!#REF!-'DADOS DOS EMPREENDIMENTOS'!#REF!))))","v":{"$error":"#REF!"}},null,1,"2009-06-01",0,{"$f":"IF(CB47<'DADOS DOS EMPREENDIMENTOS'!CD$11,0,IF(CB47='DADOS DOS EMPREENDIMENTOS'!CD$11,SUM(CD$46:CD47)*(1-'DADOS DOS EMPREENDIMENTOS'!#REF!-'DADOS DOS EMPREENDIMENTOS'!#REF!)+'DADOS DOS EMPREENDIMENTOS'!#REF!,IF(CB47='DADOS DOS EMPREENDIMENTOS'!CD$12,'DADOS DOS EMPREENDIMENTOS'!#REF!,CD47*(1-'DADOS DOS EMPREENDIMENTOS'!#REF!-'DADOS DOS EMPREENDIMENTOS'!#REF!))))","v":{"$error":"#REF!"}}]
[null,null,null,null,null,null,null,null,null,null,null,null,null,null,2,null,null,null,null,2,null,null,null,null,2,null,null,null,null,2,"2009-07-01",0,{"$f":"IF(AD48<'DADOS DOS EMPREENDIMENTOS'!AF$11,0,IF(AD48='DADOS DOS EMPREENDIMENTOS'!AF$11,SUM(AF$46:AF48)*(1-'DADOS DOS EMPREENDIMENTOS'!#REF!-'DADOS DOS EMPREENDIMENTOS'!#REF!)+'DADOS DOS EMPREENDIMENTOS'!#REF!,IF(AD48='DADOS DOS EMPREENDIMENTOS'!#REF!,'DADOS DOS EMPREENDIMENTOS'!#REF!,AF48*(1-'DADOS DOS EMPREENDIMENTOS'!#REF!-'DADOS DOS EMPREENDIMENTOS'!#REF!))))","v":{"$error":"#REF!"}},null,2,"2009-07-01",0,{"$f":"IF(AI48<'DADOS DOS EMPREENDIMENTOS'!AK$11,0,IF(AI48='DADOS DOS EMPREENDIMENTOS'!AK$11,SUM(AK$46:AK48)*(1-'DADOS DOS EMPREENDIMENTOS'!#REF!-'DADOS DOS EMPREENDIMENTOS'!#REF!)+'DADOS DOS EMPREENDIMENTOS'!#REF!,IF(AI48='DADOS DOS EMPREENDIMENTOS'!#REF!,'DADOS DOS EMPREENDIMENTOS'!#REF!,AK48*(1-'DADOS DOS EMPREENDIMENTOS'!#REF!-'DADOS DOS EMPREENDIMENTOS'!#REF!))))","v":{"$error":"#REF!"}},null,2,"2009-07-01",0,{"$f":"IF(AN48<'DADOS DOS EMPREENDIMENTOS'!AP$11,0,IF(AN48='DADOS DOS EMPREENDIMENTOS'!AP$11,SUM(AP$46:AP48)*(1-'DADOS DOS EMPREENDIMENTOS'!#REF!-'DADOS DOS EMPREENDIMENTOS'!#REF!)+'DADOS DOS EMPREENDIMENTOS'!#REF!,IF(AN48='DADOS DOS EMPREENDIMENTOS'!#REF!,'DADOS DOS EMPREENDIMENTOS'!#REF!,AP48*(1-'DADOS DOS EMPREENDIMENTOS'!#REF!-'DADOS DOS EMPREENDIMENTOS'!#REF!))))","v":{"$error":"#REF!"}},null,2,"2009-07-01",0,{"$f":"IF(AS48<'DADOS DOS EMPREENDIMENTOS'!AU$11,0,IF(AS48='DADOS DOS EMPREENDIMENTOS'!AU$11,SUM(AU$46:AU48)*(1-'DADOS DOS EMPREENDIMENTOS'!#REF!-'DADOS DOS EMPREENDIMENTOS'!#REF!)+'DADOS DOS EMPREENDIMENTOS'!#REF!,IF(AS48='DADOS DOS EMPREENDIMENTOS'!#REF!,'DADOS DOS EMPREENDIMENTOS'!#REF!,AU48*(1-'DADOS DOS EMPREENDIMENTOS'!#REF!-'DADOS DOS EMPREENDIMENTOS'!#REF!))))","v":{"$error":"#REF!"}},null,2,"2009-07-01",0,{"$f":"IF(AX48<'DADOS DOS EMPREENDIMENTOS'!AZ$11,0,IF(AX48='DADOS DOS EMPREENDIMENTOS'!AZ$11,SUM(AZ$46:AZ48)*(1-'DADOS DOS EMPREENDIMENTOS'!#REF!-'DADOS DOS EMPREENDIMENTOS'!#REF!)+'DADOS DOS EMPREENDIMENTOS'!#REF!,IF(AX48='DADOS DOS EMPREENDIMENTOS'!#REF!,'DADOS DOS EMPREENDIMENTOS'!#REF!,AZ48*(1-'DADOS DOS EMPREENDIMENTOS'!#REF!-'DADOS DOS EMPREENDIMENTOS'!#REF!))))","v":{"$error":"#REF!"}},null,2,"2009-07-01",0,{"$f":"IF(BC48<'DADOS DOS EMPREENDIMENTOS'!BE$11,0,IF(BC48='DADOS DOS EMPREENDIMENTOS'!BE$11,SUM(BE$46:BE48)*(1-'DADOS DOS EMPREENDIMENTOS'!#REF!-'DADOS DOS EMPREENDIMENTOS'!#REF!)+'DADOS DOS EMPREENDIMENTOS'!#REF!,IF(BC48='DADOS DOS EMPREENDIMENTOS'!#REF!,'DADOS DOS EMPREENDIMENTOS'!#REF!,BE48*(1-'DADOS DOS EMPREENDIMENTOS'!#REF!-'DADOS DOS EMPREENDIMENTOS'!#REF!))))","v":{"$error":"#REF!"}},null,2,"2009-07-01",0,{"$f":"IF(BH48<'DADOS DOS EMPREENDIMENTOS'!BJ$11,0,IF(BH48='DADOS DOS EMPREENDIMENTOS'!BJ$11,SUM(BJ$46:BJ48)*(1-'DADOS DOS EMPREENDIMENTOS'!#REF!-'DADOS DOS EMPREENDIMENTOS'!#REF!)+'DADOS DOS EMPREENDIMENTOS'!#REF!,IF(BH48='DADOS DOS EMPREENDIMENTOS'!#REF!,'DADOS DOS EMPREENDIMENTOS'!#REF!,BJ48*(1-'DADOS DOS EMPREENDIMENTOS'!#REF!-'DADOS DOS EMPREENDIMENTOS'!#REF!))))","v":{"$error":"#REF!"}},null,2,"2009-07-01",0,{"$f":"IF(BM48<'DADOS DOS EMPREENDIMENTOS'!BO$11,0,IF(BM48='DADOS DOS EMPREENDIMENTOS'!BO$11,SUM(BO$46:BO48)*(1-'DADOS DOS EMPREENDIMENTOS'!#REF!-'DADOS DOS EMPREENDIMENTOS'!#REF!)+'DADOS DOS EMPREENDIMENTOS'!#REF!,IF(BM48='DADOS DOS EMPREENDIMENTOS'!BO$12,'DADOS DOS EMPREENDIMENTOS'!#REF!,BO48*(1-'DADOS DOS EMPREENDIMENTOS'!#REF!-'DADOS DOS EMPREENDIMENTOS'!#REF!))))","v":{"$error":"#REF!"}},null,2,"2009-07-01",0,{"$f":"IF(BR48<'DADOS DOS EMPREENDIMENTOS'!BT$11,0,IF(BR48='DADOS DOS EMPREENDIMENTOS'!BT$11,SUM(BT$46:BT48)*(1-'DADOS DOS EMPREENDIMENTOS'!#REF!-'DADOS DOS EMPREENDIMENTOS'!#REF!)+'DADOS DOS EMPREENDIMENTOS'!#REF!,IF(BR48='DADOS DOS EMPREENDIMENTOS'!BT$12,'DADOS DOS EMPREENDIMENTOS'!#REF!,BT48*(1-'DADOS DOS EMPREENDIMENTOS'!#REF!-'DADOS DOS EMPREENDIMENTOS'!#REF!))))","v":{"$error":"#REF!"}},null,2,"2009-07-01",0,{"$f":"IF(BW48<'DADOS DOS EMPREENDIMENTOS'!BY$11,0,IF(BW48='DADOS DOS EMPREENDIMENTOS'!BY$11,SUM(BY$46:BY48)*(1-'DADOS DOS EMPREENDIMENTOS'!#REF!-'DADOS DOS EMPREENDIMENTOS'!#REF!)+'DADOS DOS EMPREENDIMENTOS'!#REF!,IF(BW48='DADOS DOS EMPREENDIMENTOS'!BY$12,'DADOS DOS EMPREENDIMENTOS'!#REF!,BY48*(1-'DADOS DOS EMPREENDIMENTOS'!#REF!-'DADOS DOS EMPREENDIMENTOS'!#REF!))))","v":{"$error":"#REF!"}},null,2,"2009-07-01",0,{"$f":"IF(CB48<'DADOS DOS EMPREENDIMENTOS'!CD$11,0,IF(CB48='DADOS DOS EMPREENDIMENTOS'!CD$11,SUM(CD$46:CD48)*(1-'DADOS DOS EMPREENDIMENTOS'!#REF!-'DADOS DOS EMPREENDIMENTOS'!#REF!)+'DADOS DOS EMPREENDIMENTOS'!#REF!,IF(CB48='DADOS DOS EMPREENDIMENTOS'!CD$12,'DADOS DOS EMPREENDIMENTOS'!#REF!,CD48*(1-'DADOS DOS EMPREENDIMENTOS'!#REF!-'DADOS DOS EMPREENDIMENTOS'!#REF!))))","v":{"$error":"#REF!"}}]
[null,null,null,null,null,null,null,null,null,null,null,null,null,null,3,null,null,null,null,3,null,null,null,null,3,null,null,null,null,3,"2009-08-01",0,{"$f":"IF(AD49<'DADOS DOS EMPREENDIMENTOS'!AF$11,0,IF(AD49='DADOS DOS EMPREENDIMENTOS'!AF$11,SUM(AF$46:AF49)*(1-'DADOS DOS EMPREENDIMENTOS'!#REF!-'DADOS DOS EMPREENDIMENTOS'!#REF!)+'DADOS DOS EMPREENDIMENTOS'!#REF!,IF(AD49='DADOS DOS EMPREENDIMENTOS'!#REF!,'DADOS DOS EMPREENDIMENTOS'!#REF!,AF49*(1-'DADOS DOS EMPREENDIMENTOS'!#REF!-'DADOS DOS EMPREENDIMENTOS'!#REF!))))","v":{"$error":"#REF!"}},null,3,"2009-08-01",0,{"$f":"IF(AI49<'DADOS DOS EMPREENDIMENTOS'!AK$11,0,IF(AI49='DADOS DOS EMPREENDIMENTOS'!AK$11,SUM(AK$46:AK49)*(1-'DADOS DOS EMPREENDIMENTOS'!#REF!-'DADOS DOS EMPREENDIMENTOS'!#REF!)+'DADOS DOS EMPREENDIMENTOS'!#REF!,IF(AI49='DADOS DOS EMPREENDIMENTOS'!#REF!,'DADOS DOS EMPREENDIMENTOS'!#REF!,AK49*(1-'DADOS DOS EMPREENDIMENTOS'!#REF!-'DADOS DOS EMPREENDIMENTOS'!#REF!))))","v":{"$error":"#REF!"}},null,3,"2009-08-01",0,{"$f":"IF(AN49<'DADOS DOS EMPREENDIMENTOS'!AP$11,0,IF(AN49='DADOS DOS EMPREENDIMENTOS'!AP$11,SUM(AP$46:AP49)*(1-'DADOS DOS EMPREENDIMENTOS'!#REF!-'DADOS DOS EMPREENDIMENTOS'!#REF!)+'DADOS DOS EMPREENDIMENTOS'!#REF!,IF(AN49='DADOS DOS EMPREENDIMENTOS'!#REF!,'DADOS DOS EMPREENDIMENTOS'!#REF!,AP49*(1-'DADOS DOS EMPREENDIMENTOS'!#REF!-'DADOS DOS EMPREENDIMENTOS'!#REF!))))","v":{"$error":"#REF!"}},null,3,"2009-08-01",0,{"$f":"IF(AS49<'DADOS DOS EMPREENDIMENTOS'!AU$11,0,IF(AS49='DADOS DOS EMPREENDIMENTOS'!AU$11,SUM(AU$46:AU49)*(1-'DADOS DOS EMPREENDIMENTOS'!#REF!-'DADOS DOS EMPREENDIMENTOS'!#REF!)+'DADOS DOS EMPREENDIMENTOS'!#REF!,IF(AS49='DADOS DOS EMPREENDIMENTOS'!#REF!,'DADOS DOS EMPREENDIMENTOS'!#REF!,AU49*(1-'DADOS DOS EMPREENDIMENTOS'!#REF!-'DADOS DOS EMPREENDIMENTOS'!#REF!))))","v":{"$error":"#REF!"}},null,3,"2009-08-01",0,{"$f":"IF(AX49<'DADOS DOS EMPREENDIMENTOS'!AZ$11,0,IF(AX49='DADOS DOS EMPREENDIMENTOS'!AZ$11,SUM(AZ$46:AZ49)*(1-'DADOS DOS EMPREENDIMENTOS'!#REF!-'DADOS DOS EMPREENDIMENTOS'!#REF!)+'DADOS DOS EMPREENDIMENTOS'!#REF!,IF(AX49='DADOS DOS EMPREENDIMENTOS'!#REF!,'DADOS DOS EMPREENDIMENTOS'!#REF!,AZ49*(1-'DADOS DOS EMPREENDIMENTOS'!#REF!-'DADOS DOS EMPREENDIMENTOS'!#REF!))))","v":{"$error":"#REF!"}},null,3,"2009-08-01",0,{"$f":"IF(BC49<'DADOS DOS EMPREENDIMENTOS'!BE$11,0,IF(BC49='DADOS DOS EMPREENDIMENTOS'!BE$11,SUM(BE$46:BE49)*(1-'DADOS DOS EMPREENDIMENTOS'!#REF!-'DADOS DOS EMPREENDIMENTOS'!#REF!)+'DADOS DOS EMPREENDIMENTOS'!#REF!,IF(BC49='DADOS DOS EMPREENDIMENTOS'!#REF!,'DADOS DOS EMPREENDIMENTOS'!#REF!,BE49*(1-'DADOS DOS EMPREENDIMENTOS'!#REF!-'DADOS DOS EMPREENDIMENTOS'!#REF!))))","v":{"$error":"#REF!"}},null,3,"2009-08-01",0,{"$f":"IF(BH49<'DADOS DOS EMPREENDIMENTOS'!BJ$11,0,IF(BH49='DADOS DOS EMPREENDIMENTOS'!BJ$11,SUM(BJ$46:BJ49)*(1-'DADOS DOS EMPREENDIMENTOS'!#REF!-'DADOS DOS EMPREENDIMENTOS'!#REF!)+'DADOS DOS EMPREENDIMENTOS'!#REF!,IF(BH49='DADOS DOS EMPREENDIMENTOS'!#REF!,'DADOS DOS EMPREENDIMENTOS'!#REF!,BJ49*(1-'DADOS DOS EMPREENDIMENTOS'!#REF!-'DADOS DOS EMPREENDIMENTOS'!#REF!))))","v":{"$error":"#REF!"}},null,3,"2009-08-01",0,{"$f":"IF(BM49<'DADOS DOS EMPREENDIMENTOS'!BO$11,0,IF(BM49='DADOS DOS EMPREENDIMENTOS'!BO$11,SUM(BO$46:BO49)*(1-'DADOS DOS EMPREENDIMENTOS'!#REF!-'DADOS DOS EMPREENDIMENTOS'!#REF!)+'DADOS DOS EMPREENDIMENTOS'!#REF!,IF(BM49='DADOS DOS EMPREENDIMENTOS'!BO$12,'DADOS DOS EMPREENDIMENTOS'!#REF!,BO49*(1-'DADOS DOS EMPREENDIMENTOS'!#REF!-'DADOS DOS EMPREENDIMENTOS'!#REF!))))","v":{"$error":"#REF!"}},null,3,"2009-08-01",0,{"$f":"IF(BR49<'DADOS DOS EMPREENDIMENTOS'!BT$11,0,IF(BR49='DADOS DOS EMPREENDIMENTOS'!BT$11,SUM(BT$46:BT49)*(1-'DADOS DOS EMPREENDIMENTOS'!#REF!-'DADOS DOS EMPREENDIMENTOS'!#REF!)+'DADOS DOS EMPREENDIMENTOS'!#REF!,IF(BR49='DADOS DOS EMPREENDIMENTOS'!BT$12,'DADOS DOS EMPREENDIMENTOS'!#REF!,BT49*(1-'DADOS DOS EMPREENDIMENTOS'!#REF!-'DADOS DOS EMPREENDIMENTOS'!#REF!))))","v":{"$error":"#REF!"}},null,3,"2009-08-01",0,{"$f":"IF(BW49<'DADOS DOS EMPREENDIMENTOS'!BY$11,0,IF(BW49='DADOS DOS EMPREENDIMENTOS'!BY$11,SUM(BY$46:BY49)*(1-'DADOS DOS EMPREENDIMENTOS'!#REF!-'DADOS DOS EMPREENDIMENTOS'!#REF!)+'DADOS DOS EMPREENDIMENTOS'!#REF!,IF(BW49='DADOS DOS EMPREENDIMENTOS'!BY$12,'DADOS DOS EMPREENDIMENTOS'!#REF!,BY49*(1-'DADOS DOS EMPREENDIMENTOS'!#REF!-'DADOS DOS EMPREENDIMENTOS'!#REF!))))","v":{"$error":"#REF!"}},null,3,"2009-08-01",0,{"$f":"IF(CB49<'DADOS DOS EMPREENDIMENTOS'!CD$11,0,IF(CB49='DADOS DOS EMPREENDIMENTOS'!CD$11,SUM(CD$46:CD49)*(1-'DADOS DOS EMPREENDIMENTOS'!#REF!-'DADOS DOS EMPREENDIMENTOS'!#REF!)+'DADOS DOS EMPREENDIMENTOS'!#REF!,IF(CB49='DADOS DOS EMPREENDIMENTOS'!CD$12,'DADOS DOS EMPREENDIMENTOS'!#REF!,CD49*(1-'DADOS DOS EMPREENDIMENTOS'!#REF!-'DADOS DOS EMPREENDIMENTOS'!#REF!))))","v":{"$error":"#REF!"}}]
[null,null,null,null,null,null,null,null,null,null,null,null,null,null,4,null,null,null,null,4,null,null,null,null,4,null,null,null,null,4,"2009-09-01",0,{"$f":"IF(AD50<'DADOS DOS EMPREENDIMENTOS'!AF$11,0,IF(AD50='DADOS DOS EMPREENDIMENTOS'!AF$11,SUM(AF$46:AF50)*(1-'DADOS DOS EMPREENDIMENTOS'!#REF!-'DADOS DOS EMPREENDIMENTOS'!#REF!)+'DADOS DOS EMPREENDIMENTOS'!#REF!,IF(AD50='DADOS DOS EMPREENDIMENTOS'!#REF!,'DADOS DOS EMPREENDIMENTOS'!#REF!,AF50*(1-'DADOS DOS EMPREENDIMENTOS'!#REF!-'DADOS DOS EMPREENDIMENTOS'!#REF!))))","v":{"$error":"#REF!"}},null,4,"2009-09-01",0,{"$f":"IF(AI50<'DADOS DOS EMPREENDIMENTOS'!AK$11,0,IF(AI50='DADOS DOS EMPREENDIMENTOS'!AK$11,SUM(AK$46:AK50)*(1-'DADOS DOS EMPREENDIMENTOS'!#REF!-'DADOS DOS EMPREENDIMENTOS'!#REF!)+'DADOS DOS EMPREENDIMENTOS'!#REF!,IF(AI50='DADOS DOS EMPREENDIMENTOS'!#REF!,'DADOS DOS EMPREENDIMENTOS'!#REF!,AK50*(1-'DADOS DOS EMPREENDIMENTOS'!#REF!-'DADOS DOS EMPREENDIMENTOS'!#REF!))))","v":{"$error":"#REF!"}},null,4,"2009-09-01",0,{"$f":"IF(AN50<'DADOS DOS EMPREENDIMENTOS'!AP$11,0,IF(AN50='DADOS DOS EMPREENDIMENTOS'!AP$11,SUM(AP$46:AP50)*(1-'DADOS DOS EMPREENDIMENTOS'!#REF!-'DADOS DOS EMPREENDIMENTOS'!#REF!)+'DADOS DOS EMPREENDIMENTOS'!#REF!,IF(AN50='DADOS DOS EMPREENDIMENTOS'!#REF!,'DADOS DOS EMPREENDIMENTOS'!#REF!,AP50*(1-'DADOS DOS EMPREENDIMENTOS'!#REF!-'DADOS DOS EMPREENDIMENTOS'!#REF!))))","v":{"$error":"#REF!"}},null,4,"2009-09-01",0,{"$f":"IF(AS50<'DADOS DOS EMPREENDIMENTOS'!AU$11,0,IF(AS50='DADOS DOS EMPREENDIMENTOS'!AU$11,SUM(AU$46:AU50)*(1-'DADOS DOS EMPREENDIMENTOS'!#REF!-'DADOS DOS EMPREENDIMENTOS'!#REF!)+'DADOS DOS EMPREENDIMENTOS'!#REF!,IF(AS50='DADOS DOS EMPREENDIMENTOS'!#REF!,'DADOS DOS EMPREENDIMENTOS'!#REF!,AU50*(1-'DADOS DOS EMPREENDIMENTOS'!#REF!-'DADOS DOS EMPREENDIMENTOS'!#REF!))))","v":{"$error":"#REF!"}},null,4,"2009-09-01",0,{"$f":"IF(AX50<'DADOS DOS EMPREENDIMENTOS'!AZ$11,0,IF(AX50='DADOS DOS EMPREENDIMENTOS'!AZ$11,SUM(AZ$46:AZ50)*(1-'DADOS DOS EMPREENDIMENTOS'!#REF!-'DADOS DOS EMPREENDIMENTOS'!#REF!)+'DADOS DOS EMPREENDIMENTOS'!#REF!,IF(AX50='DADOS DOS EMPREENDIMENTOS'!#REF!,'DADOS DOS EMPREENDIMENTOS'!#REF!,AZ50*(1-'DADOS DOS EMPREENDIMENTOS'!#REF!-'DADOS DOS EMPREENDIMENTOS'!#REF!))))","v":{"$error":"#REF!"}},null,4,"2009-09-01",0,{"$f":"IF(BC50<'DADOS DOS EMPREENDIMENTOS'!BE$11,0,IF(BC50='DADOS DOS EMPREENDIMENTOS'!BE$11,SUM(BE$46:BE50)*(1-'DADOS DOS EMPREENDIMENTOS'!#REF!-'DADOS DOS EMPREENDIMENTOS'!#REF!)+'DADOS DOS EMPREENDIMENTOS'!#REF!,IF(BC50='DADOS DOS EMPREENDIMENTOS'!#REF!,'DADOS DOS EMPREENDIMENTOS'!#REF!,BE50*(1-'DADOS DOS EMPREENDIMENTOS'!#REF!-'DADOS DOS EMPREENDIMENTOS'!#REF!))))","v":{"$error":"#REF!"}},null,4,"2009-09-01",0,{"$f":"IF(BH50<'DADOS DOS EMPREENDIMENTOS'!BJ$11,0,IF(BH50='DADOS DOS EMPREENDIMENTOS'!BJ$11,SUM(BJ$46:BJ50)*(1-'DADOS DOS EMPREENDIMENTOS'!#REF!-'DADOS DOS EMPREENDIMENTOS'!#REF!)+'DADOS DOS EMPREENDIMENTOS'!#REF!,IF(BH50='DADOS DOS EMPREENDIMENTOS'!#REF!,'DADOS DOS EMPREENDIMENTOS'!#REF!,BJ50*(1-'DADOS DOS EMPREENDIMENTOS'!#REF!-'DADOS DOS EMPREENDIMENTOS'!#REF!))))","v":{"$error":"#REF!"}},null,4,"2009-09-01",0,{"$f":"IF(BM50<'DADOS DOS EMPREENDIMENTOS'!BO$11,0,IF(BM50='DADOS DOS EMPREENDIMENTOS'!BO$11,SUM(BO$46:BO50)*(1-'DADOS DOS EMPREENDIMENTOS'!#REF!-'DADOS DOS EMPREENDIMENTOS'!#REF!)+'DADOS DOS EMPREENDIMENTOS'!#REF!,IF(BM50='DADOS DOS EMPREENDIMENTOS'!BO$12,'DADOS DOS EMPREENDIMENTOS'!#REF!,BO50*(1-'DADOS DOS EMPREENDIMENTOS'!#REF!-'DADOS DOS EMPREENDIMENTOS'!#REF!))))","v":{"$error":"#REF!"}},null,4,"2009-09-01",0,{"$f":"IF(BR50<'DADOS DOS EMPREENDIMENTOS'!BT$11,0,IF(BR50='DADOS DOS EMPREENDIMENTOS'!BT$11,SUM(BT$46:BT50)*(1-'DADOS DOS EMPREENDIMENTOS'!#REF!-'DADOS DOS EMPREENDIMENTOS'!#REF!)+'DADOS DOS EMPREENDIMENTOS'!#REF!,IF(BR50='DADOS DOS EMPREENDIMENTOS'!BT$12,'DADOS DOS EMPREENDIMENTOS'!#REF!,BT50*(1-'DADOS DOS EMPREENDIMENTOS'!#REF!-'DADOS DOS EMPREENDIMENTOS'!#REF!))))","v":{"$error":"#REF!"}},null,4,"2009-09-01",0,{"$f":"IF(BW50<'DADOS DOS EMPREENDIMENTOS'!BY$11,0,IF(BW50='DADOS DOS EMPREENDIMENTOS'!BY$11,SUM(BY$46:BY50)*(1-'DADOS DOS EMPREENDIMENTOS'!#REF!-'DADOS DOS EMPREENDIMENTOS'!#REF!)+'DADOS DOS EMPREENDIMENTOS'!#REF!,IF(BW50='DADOS DOS EMPREENDIMENTOS'!BY$12,'DADOS DOS EMPREENDIMENTOS'!#REF!,BY50*(1-'DADOS DOS EMPREENDIMENTOS'!#REF!-'DADOS DOS EMPREENDIMENTOS'!#REF!))))","v":{"$error":"#REF!"}},null,4,"2009-09-01",0,{"$f":"IF(CB50<'DADOS DOS EMPREENDIMENTOS'!CD$11,0,IF(CB50='DADOS DOS EMPREENDIMENTOS'!CD$11,SUM(CD$46:CD50)*(1-'DADOS DOS EMPREENDIMENTOS'!#REF!-'DADOS DOS EMPREENDIMENTOS'!#REF!)+'DADOS DOS EMPREENDIMENTOS'!#REF!,IF(CB50='DADOS DOS EMPREENDIMENTOS'!CD$12,'DADOS DOS EMPREENDIMENTOS'!#REF!,CD50*(1-'DADOS DOS EMPREENDIMENTOS'!#REF!-'DADOS DOS EMPREENDIMENTOS'!#REF!))))","v":{"$error":"#REF!"}}]
[null,null,null,null,null,null,null,null,null,null,null,null,null,null,5,null,null,null,null,5,null,null,null,null,5,null,null,null,null,5,"2009-10-01",0,{"$f":"IF(AD51<'DADOS DOS EMPREENDIMENTOS'!AF$11,0,IF(AD51='DADOS DOS EMPREENDIMENTOS'!AF$11,SUM(AF$46:AF51)*(1-'DADOS DOS EMPREENDIMENTOS'!#REF!-'DADOS DOS EMPREENDIMENTOS'!#REF!)+'DADOS DOS EMPREENDIMENTOS'!#REF!,IF(AD51='DADOS DOS EMPREENDIMENTOS'!#REF!,'DADOS DOS EMPREENDIMENTOS'!#REF!,AF51*(1-'DADOS DOS EMPREENDIMENTOS'!#REF!-'DADOS DOS EMPREENDIMENTOS'!#REF!))))","v":{"$error":"#REF!"}},null,5,"2009-10-01",0,{"$f":"IF(AI51<'DADOS DOS EMPREENDIMENTOS'!AK$11,0,IF(AI51='DADOS DOS EMPREENDIMENTOS'!AK$11,SUM(AK$46:AK51)*(1-'DADOS DOS EMPREENDIMENTOS'!#REF!-'DADOS DOS EMPREENDIMENTOS'!#REF!)+'DADOS DOS EMPREENDIMENTOS'!#REF!,IF(AI51='DADOS DOS EMPREENDIMENTOS'!#REF!,'DADOS DOS EMPREENDIMENTOS'!#REF!,AK51*(1-'DADOS DOS EMPREENDIMENTOS'!#REF!-'DADOS DOS EMPREENDIMENTOS'!#REF!))))","v":{"$error":"#REF!"}},null,5,"2009-10-01",0,{"$f":"IF(AN51<'DADOS DOS EMPREENDIMENTOS'!AP$11,0,IF(AN51='DADOS DOS EMPREENDIMENTOS'!AP$11,SUM(AP$46:AP51)*(1-'DADOS DOS EMPREENDIMENTOS'!#REF!-'DADOS DOS EMPREENDIMENTOS'!#REF!)+'DADOS DOS EMPREENDIMENTOS'!#REF!,IF(AN51='DADOS DOS EMPREENDIMENTOS'!#REF!,'DADOS DOS EMPREENDIMENTOS'!#REF!,AP51*(1-'DADOS DOS EMPREENDIMENTOS'!#REF!-'DADOS DOS EMPREENDIMENTOS'!#REF!))))","v":{"$error":"#REF!"}},null,5,"2009-10-01",0,{"$f":"IF(AS51<'DADOS DOS EMPREENDIMENTOS'!AU$11,0,IF(AS51='DADOS DOS EMPREENDIMENTOS'!AU$11,SUM(AU$46:AU51)*(1-'DADOS DOS EMPREENDIMENTOS'!#REF!-'DADOS DOS EMPREENDIMENTOS'!#REF!)+'DADOS DOS EMPREENDIMENTOS'!#REF!,IF(AS51='DADOS DOS EMPREENDIMENTOS'!#REF!,'DADOS DOS EMPREENDIMENTOS'!#REF!,AU51*(1-'DADOS DOS EMPREENDIMENTOS'!#REF!-'DADOS DOS EMPREENDIMENTOS'!#REF!))))","v":{"$error":"#REF!"}},null,5,"2009-10-01",0,{"$f":"IF(AX51<'DADOS DOS EMPREENDIMENTOS'!AZ$11,0,IF(AX51='DADOS DOS EMPREENDIMENTOS'!AZ$11,SUM(AZ$46:AZ51)*(1-'DADOS DOS EMPREENDIMENTOS'!#REF!-'DADOS DOS EMPREENDIMENTOS'!#REF!)+'DADOS DOS EMPREENDIMENTOS'!#REF!,IF(AX51='DADOS DOS EMPREENDIMENTOS'!#REF!,'DADOS DOS EMPREENDIMENTOS'!#REF!,AZ51*(1-'DADOS DOS EMPREENDIMENTOS'!#REF!-'DADOS DOS EMPREENDIMENTOS'!#REF!))))","v":{"$error":"#REF!"}},null,5,"2009-10-01",0,{"$f":"IF(BC51<'DADOS DOS EMPREENDIMENTOS'!BE$11,0,IF(BC51='DADOS DOS EMPREENDIMENTOS'!BE$11,SUM(BE$46:BE51)*(1-'DADOS DOS EMPREENDIMENTOS'!#REF!-'DADOS DOS EMPREENDIMENTOS'!#REF!)+'DADOS DOS EMPREENDIMENTOS'!#REF!,IF(BC51='DADOS DOS EMPREENDIMENTOS'!#REF!,'DADOS DOS EMPREENDIMENTOS'!#REF!,BE51*(1-'DADOS DOS EMPREENDIMENTOS'!#REF!-'DADOS DOS EMPREENDIMENTOS'!#REF!))))","v":{"$error":"#REF!"}},null,5,"2009-10-01",0,{"$f":"IF(BH51<'DADOS DOS EMPREENDIMENTOS'!BJ$11,0,IF(BH51='DADOS DOS EMPREENDIMENTOS'!BJ$11,SUM(BJ$46:BJ51)*(1-'DADOS DOS EMPREENDIMENTOS'!#REF!-'DADOS DOS EMPREENDIMENTOS'!#REF!)+'DADOS DOS EMPREENDIMENTOS'!#REF!,IF(BH51='DADOS DOS EMPREENDIMENTOS'!#REF!,'DADOS DOS EMPREENDIMENTOS'!#REF!,BJ51*(1-'DADOS DOS EMPREENDIMENTOS'!#REF!-'DADOS DOS EMPREENDIMENTOS'!#REF!))))","v":{"$error":"#REF!"}},null,5,"2009-10-01",0,{"$f":"IF(BM51<'DADOS DOS EMPREENDIMENTOS'!BO$11,0,IF(BM51='DADOS DOS EMPREENDIMENTOS'!BO$11,SUM(BO$46:BO51)*(1-'DADOS DOS EMPREENDIMENTOS'!#REF!-'DADOS DOS EMPREENDIMENTOS'!#REF!)+'DADOS DOS EMPREENDIMENTOS'!#REF!,IF(BM51='DADOS DOS EMPREENDIMENTOS'!BO$12,'DADOS DOS EMPREENDIMENTOS'!#REF!,BO51*(1-'DADOS DOS EMPREENDIMENTOS'!#REF!-'DADOS DOS EMPREENDIMENTOS'!#REF!))))","v":{"$error":"#REF!"}},null,5,"2009-10-01",0,{"$f":"IF(BR51<'DADOS DOS EMPREENDIMENTOS'!BT$11,0,IF(BR51='DADOS DOS EMPREENDIMENTOS'!BT$11,SUM(BT$46:BT51)*(1-'DADOS DOS EMPREENDIMENTOS'!#REF!-'DADOS DOS EMPREENDIMENTOS'!#REF!)+'DADOS DOS EMPREENDIMENTOS'!#REF!,IF(BR51='DADOS DOS EMPREENDIMENTOS'!BT$12,'DADOS DOS EMPREENDIMENTOS'!#REF!,BT51*(1-'DADOS DOS EMPREENDIMENTOS'!#REF!-'DADOS DOS EMPREENDIMENTOS'!#REF!))))","v":{"$error":"#REF!"}},null,5,"2009-10-01",0,{"$f":"IF(BW51<'DADOS DOS EMPREENDIMENTOS'!BY$11,0,IF(BW51='DADOS DOS EMPREENDIMENTOS'!BY$11,SUM(BY$46:BY51)*(1-'DADOS DOS EMPREENDIMENTOS'!#REF!-'DADOS DOS EMPREENDIMENTOS'!#REF!)+'DADOS DOS EMPREENDIMENTOS'!#REF!,IF(BW51='DADOS DOS EMPREENDIMENTOS'!BY$12,'DADOS DOS EMPREENDIMENTOS'!#REF!,BY51*(1-'DADOS DOS EMPREENDIMENTOS'!#REF!-'DADOS DOS EMPREENDIMENTOS'!#REF!))))","v":{"$error":"#REF!"}},null,5,"2009-10-01",0,{"$f":"IF(CB51<'DADOS DOS EMPREENDIMENTOS'!CD$11,0,IF(CB51='DADOS DOS EMPREENDIMENTOS'!CD$11,SUM(CD$46:CD51)*(1-'DADOS DOS EMPREENDIMENTOS'!#REF!-'DADOS DOS EMPREENDIMENTOS'!#REF!)+'DADOS DOS EMPREENDIMENTOS'!#REF!,IF(CB51='DADOS DOS EMPREENDIMENTOS'!CD$12,'DADOS DOS EMPREENDIMENTOS'!#REF!,CD51*(1-'DADOS DOS EMPREENDIMENTOS'!#REF!-'DADOS DOS EMPREENDIMENTOS'!#REF!))))","v":{"$error":"#REF!"}}]
[null,null,null,null,null,null,null,null,null,null,null,null,null,null,6,null,null,null,null,6,null,null,null,null,6,null,null,null,null,6,"2009-11-01",0,{"$f":"IF(AD52<'DADOS DOS EMPREENDIMENTOS'!AF$11,0,IF(AD52='DADOS DOS EMPREENDIMENTOS'!AF$11,SUM(AF$46:AF52)*(1-'DADOS DOS EMPREENDIMENTOS'!#REF!-'DADOS DOS EMPREENDIMENTOS'!#REF!)+'DADOS DOS EMPREENDIMENTOS'!#REF!,IF(AD52='DADOS DOS EMPREENDIMENTOS'!#REF!,'DADOS DOS EMPREENDIMENTOS'!#REF!,AF52*(1-'DADOS DOS EMPREENDIMENTOS'!#REF!-'DADOS DOS EMPREENDIMENTOS'!#REF!))))","v":{"$error":"#REF!"}},null,6,"2009-11-01",0,{"$f":"IF(AI52<'DADOS DOS EMPREENDIMENTOS'!AK$11,0,IF(AI52='DADOS DOS EMPREENDIMENTOS'!AK$11,SUM(AK$46:AK52)*(1-'DADOS DOS EMPREENDIMENTOS'!#REF!-'DADOS DOS EMPREENDIMENTOS'!#REF!)+'DADOS DOS EMPREENDIMENTOS'!#REF!,IF(AI52='DADOS DOS EMPREENDIMENTOS'!#REF!,'DADOS DOS EMPREENDIMENTOS'!#REF!,AK52*(1-'DADOS DOS EMPREENDIMENTOS'!#REF!-'DADOS DOS EMPREENDIMENTOS'!#REF!))))","v":{"$error":"#REF!"}},null,6,"2009-11-01",0,{"$f":"IF(AN52<'DADOS DOS EMPREENDIMENTOS'!AP$11,0,IF(AN52='DADOS DOS EMPREENDIMENTOS'!AP$11,SUM(AP$46:AP52)*(1-'DADOS DOS EMPREENDIMENTOS'!#REF!-'DADOS DOS EMPREENDIMENTOS'!#REF!)+'DADOS DOS EMPREENDIMENTOS'!#REF!,IF(AN52='DADOS DOS EMPREENDIMENTOS'!#REF!,'DADOS DOS EMPREENDIMENTOS'!#REF!,AP52*(1-'DADOS DOS EMPREENDIMENTOS'!#REF!-'DADOS DOS EMPREENDIMENTOS'!#REF!))))","v":{"$error":"#REF!"}},null,6,"2009-11-01",0,{"$f":"IF(AS52<'DADOS DOS EMPREENDIMENTOS'!AU$11,0,IF(AS52='DADOS DOS EMPREENDIMENTOS'!AU$11,SUM(AU$46:AU52)*(1-'DADOS DOS EMPREENDIMENTOS'!#REF!-'DADOS DOS EMPREENDIMENTOS'!#REF!)+'DADOS DOS EMPREENDIMENTOS'!#REF!,IF(AS52='DADOS DOS EMPREENDIMENTOS'!#REF!,'DADOS DOS EMPREENDIMENTOS'!#REF!,AU52*(1-'DADOS DOS EMPREENDIMENTOS'!#REF!-'DADOS DOS EMPREENDIMENTOS'!#REF!))))","v":{"$error":"#REF!"}},null,6,"2009-11-01",0,{"$f":"IF(AX52<'DADOS DOS EMPREENDIMENTOS'!AZ$11,0,IF(AX52='DADOS DOS EMPREENDIMENTOS'!AZ$11,SUM(AZ$46:AZ52)*(1-'DADOS DOS EMPREENDIMENTOS'!#REF!-'DADOS DOS EMPREENDIMENTOS'!#REF!)+'DADOS DOS EMPREENDIMENTOS'!#REF!,IF(AX52='DADOS DOS EMPREENDIMENTOS'!#REF!,'DADOS DOS EMPREENDIMENTOS'!#REF!,AZ52*(1-'DADOS DOS EMPREENDIMENTOS'!#REF!-'DADOS DOS EMPREENDIMENTOS'!#REF!))))","v":{"$error":"#REF!"}},null,6,"2009-11-01",0,{"$f":"IF(BC52<'DADOS DOS EMPREENDIMENTOS'!BE$11,0,IF(BC52='DADOS DOS EMPREENDIMENTOS'!BE$11,SUM(BE$46:BE52)*(1-'DADOS DOS EMPREENDIMENTOS'!#REF!-'DADOS DOS EMPREENDIMENTOS'!#REF!)+'DADOS DOS EMPREENDIMENTOS'!#REF!,IF(BC52='DADOS DOS EMPREENDIMENTOS'!#REF!,'DADOS DOS EMPREENDIMENTOS'!#REF!,BE52*(1-'DADOS DOS EMPREENDIMENTOS'!#REF!-'DADOS DOS EMPREENDIMENTOS'!#REF!))))","v":{"$error":"#REF!"}},null,6,"2009-11-01",0,{"$f":"IF(BH52<'DADOS DOS EMPREENDIMENTOS'!BJ$11,0,IF(BH52='DADOS DOS EMPREENDIMENTOS'!BJ$11,SUM(BJ$46:BJ52)*(1-'DADOS DOS EMPREENDIMENTOS'!#REF!-'DADOS DOS EMPREENDIMENTOS'!#REF!)+'DADOS DOS EMPREENDIMENTOS'!#REF!,IF(BH52='DADOS DOS EMPREENDIMENTOS'!#REF!,'DADOS DOS EMPREENDIMENTOS'!#REF!,BJ52*(1-'DADOS DOS EMPREENDIMENTOS'!#REF!-'DADOS DOS EMPREENDIMENTOS'!#REF!))))","v":{"$error":"#REF!"}},null,6,"2009-11-01",0,{"$f":"IF(BM52<'DADOS DOS EMPREENDIMENTOS'!BO$11,0,IF(BM52='DADOS DOS EMPREENDIMENTOS'!BO$11,SUM(BO$46:BO52)*(1-'DADOS DOS EMPREENDIMENTOS'!#REF!-'DADOS DOS EMPREENDIMENTOS'!#REF!)+'DADOS DOS EMPREENDIMENTOS'!#REF!,IF(BM52='DADOS DOS EMPREENDIMENTOS'!BO$12,'DADOS DOS EMPREENDIMENTOS'!#REF!,BO52*(1-'DADOS DOS EMPREENDIMENTOS'!#REF!-'DADOS DOS EMPREENDIMENTOS'!#REF!))))","v":{"$error":"#REF!"}},null,6,"2009-11-01",0,{"$f":"IF(BR52<'DADOS DOS EMPREENDIMENTOS'!BT$11,0,IF(BR52='DADOS DOS EMPREENDIMENTOS'!BT$11,SUM(BT$46:BT52)*(1-'DADOS DOS EMPREENDIMENTOS'!#REF!-'DADOS DOS EMPREENDIMENTOS'!#REF!)+'DADOS DOS EMPREENDIMENTOS'!#REF!,IF(BR52='DADOS DOS EMPREENDIMENTOS'!BT$12,'DADOS DOS EMPREENDIMENTOS'!#REF!,BT52*(1-'DADOS DOS EMPREENDIMENTOS'!#REF!-'DADOS DOS EMPREENDIMENTOS'!#REF!))))","v":{"$error":"#REF!"}},null,6,"2009-11-01",0,{"$f":"IF(BW52<'DADOS DOS EMPREENDIMENTOS'!BY$11,0,IF(BW52='DADOS DOS EMPREENDIMENTOS'!BY$11,SUM(BY$46:BY52)*(1-'DADOS DOS EMPREENDIMENTOS'!#REF!-'DADOS DOS EMPREENDIMENTOS'!#REF!)+'DADOS DOS EMPREENDIMENTOS'!#REF!,IF(BW52='DADOS DOS EMPREENDIMENTOS'!BY$12,'DADOS DOS EMPREENDIMENTOS'!#REF!,BY52*(1-'DADOS DOS EMPREENDIMENTOS'!#REF!-'DADOS DOS EMPREENDIMENTOS'!#REF!))))","v":{"$error":"#REF!"}},null,6,"2009-11-01",0,{"$f":"IF(CB52<'DADOS DOS EMPREENDIMENTOS'!CD$11,0,IF(CB52='DADOS DOS EMPREENDIMENTOS'!CD$11,SUM(CD$46:CD52)*(1-'DADOS DOS EMPREENDIMENTOS'!#REF!-'DADOS DOS EMPREENDIMENTOS'!#REF!)+'DADOS DOS EMPREENDIMENTOS'!#REF!,IF(CB52='DADOS DOS EMPREENDIMENTOS'!CD$12,'DADOS DOS EMPREENDIMENTOS'!#REF!,CD52*(1-'DADOS DOS EMPREENDIMENTOS'!#REF!-'DADOS DOS EMPREENDIMENTOS'!#REF!))))","v":{"$error":"#REF!"}}]
[null,null,null,null,null,null,null,null,null,null,null,null,null,null,7,null,null,null,null,7,null,null,null,null,7,null,null,null,null,7,"2009-12-01",1.570000040555336E-2,{"$f":"IF(AD53<'DADOS DOS EMPREENDIMENTOS'!AF$11,0,IF(AD53='DADOS DOS EMPREENDIMENTOS'!AF$11,SUM(AF$46:AF53)*(1-'DADOS DOS EMPREENDIMENTOS'!#REF!-'DADOS DOS EMPREENDIMENTOS'!#REF!)+'DADOS DOS EMPREENDIMENTOS'!#REF!,IF(AD53='DADOS DOS EMPREENDIMENTOS'!#REF!,'DADOS DOS EMPREENDIMENTOS'!#REF!,AF53*(1-'DADOS DOS EMPREENDIMENTOS'!#REF!-'DADOS DOS EMPREENDIMENTOS'!#REF!))))","v":{"$error":"#REF!"}},null,7,"2009-12-01",1.570000040555336E-2,{"$f":"IF(AI53<'DADOS DOS EMPREENDIMENTOS'!AK$11,0,IF(AI53='DADOS DOS EMPREENDIMENTOS'!AK$11,SUM(AK$46:AK53)*(1-'DADOS DOS EMPREENDIMENTOS'!#REF!-'DADOS DOS EMPREENDIMENTOS'!#REF!)+'DADOS DOS EMPREENDIMENTOS'!#REF!,IF(AI53='DADOS DOS EMPREENDIMENTOS'!#REF!,'DADOS DOS EMPREENDIMENTOS'!#REF!,AK53*(1-'DADOS DOS EMPREENDIMENTOS'!#REF!-'DADOS DOS EMPREENDIMENTOS'!#REF!))))","v":{"$error":"#REF!"}},null,7,"2009-12-01",1.570000040555336E-2,{"$f":"IF(AN53<'DADOS DOS EMPREENDIMENTOS'!AP$11,0,IF(AN53='DADOS DOS EMPREENDIMENTOS'!AP$11,SUM(AP$46:AP53)*(1-'DADOS DOS EMPREENDIMENTOS'!#REF!-'DADOS DOS EMPREENDIMENTOS'!#REF!)+'DADOS DOS EMPREENDIMENTOS'!#REF!,IF(AN53='DADOS DOS EMPREENDIMENTOS'!#REF!,'DADOS DOS EMPREENDIMENTOS'!#REF!,AP53*(1-'DADOS DOS EMPREENDIMENTOS'!#REF!-'DADOS DOS EMPREENDIMENTOS'!#REF!))))","v":{"$error":"#REF!"}},null,7,"2009-12-01",1.570000040555336E-2,{"$f":"IF(AS53<'DADOS DOS EMPREENDIMENTOS'!AU$11,0,IF(AS53='DADOS DOS EMPREENDIMENTOS'!AU$11,SUM(AU$46:AU53)*(1-'DADOS DOS EMPREENDIMENTOS'!#REF!-'DADOS DOS EMPREENDIMENTOS'!#REF!)+'DADOS DOS EMPREENDIMENTOS'!#REF!,IF(AS53='DADOS DOS EMPREENDIMENTOS'!#REF!,'DADOS DOS EMPREENDIMENTOS'!#REF!,AU53*(1-'DADOS DOS EMPREENDIMENTOS'!#REF!-'DADOS DOS EMPREENDIMENTOS'!#REF!))))","v":{"$error":"#REF!"}},null,7,"2009-12-01",1.570000040555336E-2,{"$f":"IF(AX53<'DADOS DOS EMPREENDIMENTOS'!AZ$11,0,IF(AX53='DADOS DOS EMPREENDIMENTOS'!AZ$11,SUM(AZ$46:AZ53)*(1-'DADOS DOS EMPREENDIMENTOS'!#REF!-'DADOS DOS EMPREENDIMENTOS'!#REF!)+'DADOS DOS EMPREENDIMENTOS'!#REF!,IF(AX53='DADOS DOS EMPREENDIMENTOS'!#REF!,'DADOS DOS EMPREENDIMENTOS'!#REF!,AZ53*(1-'DADOS DOS EMPREENDIMENTOS'!#REF!-'DADOS DOS EMPREENDIMENTOS'!#REF!))))","v":{"$error":"#REF!"}},null,7,"2009-12-01",1.570000040555336E-2,{"$f":"IF(BC53<'DADOS DOS EMPREENDIMENTOS'!BE$11,0,IF(BC53='DADOS DOS EMPREENDIMENTOS'!BE$11,SUM(BE$46:BE53)*(1-'DADOS DOS EMPREENDIMENTOS'!#REF!-'DADOS DOS EMPREENDIMENTOS'!#REF!)+'DADOS DOS EMPREENDIMENTOS'!#REF!,IF(BC53='DADOS DOS EMPREENDIMENTOS'!#REF!,'DADOS DOS EMPREENDIMENTOS'!#REF!,BE53*(1-'DADOS DOS EMPREENDIMENTOS'!#REF!-'DADOS DOS EMPREENDIMENTOS'!#REF!))))","v":{"$error":"#REF!"}},null,7,"2009-12-01",1.570000040555336E-2,{"$f":"IF(BH53<'DADOS DOS EMPREENDIMENTOS'!BJ$11,0,IF(BH53='DADOS DOS EMPREENDIMENTOS'!BJ$11,SUM(BJ$46:BJ53)*(1-'DADOS DOS EMPREENDIMENTOS'!#REF!-'DADOS DOS EMPREENDIMENTOS'!#REF!)+'DADOS DOS EMPREENDIMENTOS'!#REF!,IF(BH53='DADOS DOS EMPREENDIMENTOS'!#REF!,'DADOS DOS EMPREENDIMENTOS'!#REF!,BJ53*(1-'DADOS DOS EMPREENDIMENTOS'!#REF!-'DADOS DOS EMPREENDIMENTOS'!#REF!))))","v":{"$error":"#REF!"}},null,7,"2009-12-01",1.570000040555336E-2,{"$f":"IF(BM53<'DADOS DOS EMPREENDIMENTOS'!BO$11,0,IF(BM53='DADOS DOS EMPREENDIMENTOS'!BO$11,SUM(BO$46:BO53)*(1-'DADOS DOS EMPREENDIMENTOS'!#REF!-'DADOS DOS EMPREENDIMENTOS'!#REF!)+'DADOS DOS EMPREENDIMENTOS'!#REF!,IF(BM53='DADOS DOS EMPREENDIMENTOS'!BO$12,'DADOS DOS EMPREENDIMENTOS'!#REF!,BO53*(1-'DADOS DOS EMPREENDIMENTOS'!#REF!-'DADOS DOS EMPREENDIMENTOS'!#REF!))))","v":{"$error":"#REF!"}},null,7,"2009-12-01",1.570000040555336E-2,{"$f":"IF(BR53<'DADOS DOS EMPREENDIMENTOS'!BT$11,0,IF(BR53='DADOS DOS EMPREENDIMENTOS'!BT$11,SUM(BT$46:BT53)*(1-'DADOS DOS EMPREENDIMENTOS'!#REF!-'DADOS DOS EMPREENDIMENTOS'!#REF!)+'DADOS DOS EMPREENDIMENTOS'!#REF!,IF(BR53='DADOS DOS EMPREENDIMENTOS'!BT$12,'DADOS DOS EMPREENDIMENTOS'!#REF!,BT53*(1-'DADOS DOS EMPREENDIMENTOS'!#REF!-'DADOS DOS EMPREENDIMENTOS'!#REF!))))","v":{"$error":"#REF!"}},null,7,"2009-12-01",1.570000040555336E-2,{"$f":"IF(BW53<'DADOS DOS EMPREENDIMENTOS'!BY$11,0,IF(BW53='DADOS DOS EMPREENDIMENTOS'!BY$11,SUM(BY$46:BY53)*(1-'DADOS DOS EMPREENDIMENTOS'!#REF!-'DADOS DOS EMPREENDIMENTOS'!#REF!)+'DADOS DOS EMPREENDIMENTOS'!#REF!,IF(BW53='DADOS DOS EMPREENDIMENTOS'!BY$12,'DADOS DOS EMPREENDIMENTOS'!#REF!,BY53*(1-'DADOS DOS EMPREENDIMENTOS'!#REF!-'DADOS DOS EMPREENDIMENTOS'!#REF!))))","v":{"$error":"#REF!"}},null,7,"2009-12-01",1.570000040555336E-2,{"$f":"IF(CB53<'DADOS DOS EMPREENDIMENTOS'!CD$11,0,IF(CB53='DADOS DOS EMPREENDIMENTOS'!CD$11,SUM(CD$46:CD53)*(1-'DADOS DOS EMPREENDIMENTOS'!#REF!-'DADOS DOS EMPREENDIMENTOS'!#REF!)+'DADOS DOS EMPREENDIMENTOS'!#REF!,IF(CB53='DADOS DOS EMPREENDIMENTOS'!CD$12,'DADOS DOS EMPREENDIMENTOS'!#REF!,CD53*(1-'DADOS DOS EMPREENDIMENTOS'!#REF!-'DADOS DOS EMPREENDIMENTOS'!#REF!))))","v":{"$error":"#REF!"}}]
[null,null,null,null,null,null,null,null,null,null,null,null,null,null,8,null,null,null,null,8,null,null,null,null,8,null,null,null,null,8,"2010-01-01",4.6099999744609189E-2,{"$f":"IF(AD54<'DADOS DOS EMPREENDIMENTOS'!AF$11,0,IF(AD54='DADOS DOS EMPREENDIMENTOS'!AF$11,SUM(AF$46:AF54)*(1-'DADOS DOS EMPREENDIMENTOS'!#REF!-'DADOS DOS EMPREENDIMENTOS'!#REF!)+'DADOS DOS EMPREENDIMENTOS'!#REF!,IF(AD54='DADOS DOS EMPREENDIMENTOS'!#REF!,'DADOS DOS EMPREENDIMENTOS'!#REF!,AF54*(1-'DADOS DOS EMPREENDIMENTOS'!#REF!-'DADOS DOS EMPREENDIMENTOS'!#REF!))))","v":{"$error":"#REF!"}},null,8,"2010-01-01",4.6099999744609189E-2,{"$f":"IF(AI54<'DADOS DOS EMPREENDIMENTOS'!AK$11,0,IF(AI54='DADOS DOS EMPREENDIMENTOS'!AK$11,SUM(AK$46:AK54)*(1-'DADOS DOS EMPREENDIMENTOS'!#REF!-'DADOS DOS EMPREENDIMENTOS'!#REF!)+'DADOS DOS EMPREENDIMENTOS'!#REF!,IF(AI54='DADOS DOS EMPREENDIMENTOS'!#REF!,'DADOS DOS EMPREENDIMENTOS'!#REF!,AK54*(1-'DADOS DOS EMPREENDIMENTOS'!#REF!-'DADOS DOS EMPREENDIMENTOS'!#REF!))))","v":{"$error":"#REF!"}},null,8,"2010-01-01",4.6099999744609189E-2,{"$f":"IF(AN54<'DADOS DOS EMPREENDIMENTOS'!AP$11,0,IF(AN54='DADOS DOS EMPREENDIMENTOS'!AP$11,SUM(AP$46:AP54)*(1-'DADOS DOS EMPREENDIMENTOS'!#REF!-'DADOS DOS EMPREENDIMENTOS'!#REF!)+'DADOS DOS EMPREENDIMENTOS'!#REF!,IF(AN54='DADOS DOS EMPREENDIMENTOS'!#REF!,'DADOS DOS EMPREENDIMENTOS'!#REF!,AP54*(1-'DADOS DOS EMPREENDIMENTOS'!#REF!-'DADOS DOS EMPREENDIMENTOS'!#REF!))))","v":{"$error":"#REF!"}},null,8,"2010-01-01",4.6099999744609189E-2,{"$f":"IF(AS54<'DADOS DOS EMPREENDIMENTOS'!AU$11,0,IF(AS54='DADOS DOS EMPREENDIMENTOS'!AU$11,SUM(AU$46:AU54)*(1-'DADOS DOS EMPREENDIMENTOS'!#REF!-'DADOS DOS EMPREENDIMENTOS'!#REF!)+'DADOS DOS EMPREENDIMENTOS'!#REF!,IF(AS54='DADOS DOS EMPREENDIMENTOS'!#REF!,'DADOS DOS EMPREENDIMENTOS'!#REF!,AU54*(1-'DADOS DOS EMPREENDIMENTOS'!#REF!-'DADOS DOS EMPREENDIMENTOS'!#REF!))))","v":{"$error":"#REF!"}},null,8,"2010-01-01",4.6099999744609189E-2,{"$f":"IF(AX54<'DADOS DOS EMPREENDIMENTOS'!AZ$11,0,IF(AX54='DADOS DOS EMPREENDIMENTOS'!AZ$11,SUM(AZ$46:AZ54)*(1-'DADOS DOS EMPREENDIMENTOS'!#REF!-'DADOS DOS EMPREENDIMENTOS'!#REF!)+'DADOS DOS EMPREENDIMENTOS'!#REF!,IF(AX54='DADOS DOS EMPREENDIMENTOS'!#REF!,'DADOS DOS EMPREENDIMENTOS'!#REF!,AZ54*(1-'DADOS DOS EMPREENDIMENTOS'!#REF!-'DADOS DOS EMPREENDIMENTOS'!#REF!))))","v":{"$error":"#REF!"}},null,8,"2010-01-01",4.6099999744609189E-2,{"$f":"IF(BC54<'DADOS DOS EMPREENDIMENTOS'!BE$11,0,IF(BC54='DADOS DOS EMPREENDIMENTOS'!BE$11,SUM(BE$46:BE54)*(1-'DADOS DOS EMPREENDIMENTOS'!#REF!-'DADOS DOS EMPREENDIMENTOS'!#REF!)+'DADOS DOS EMPREENDIMENTOS'!#REF!,IF(BC54='DADOS DOS EMPREENDIMENTOS'!#REF!,'DADOS DOS EMPREENDIMENTOS'!#REF!,BE54*(1-'DADOS DOS EMPREENDIMENTOS'!#REF!-'DADOS DOS EMPREENDIMENTOS'!#REF!))))","v":{"$error":"#REF!"}},null,8,"2010-01-01",4.6099999744609189E-2,{"$f":"IF(BH54<'DADOS DOS EMPREENDIMENTOS'!BJ$11,0,IF(BH54='DADOS DOS EMPREENDIMENTOS'!BJ$11,SUM(BJ$46:BJ54)*(1-'DADOS DOS EMPREENDIMENTOS'!#REF!-'DADOS DOS EMPREENDIMENTOS'!#REF!)+'DADOS DOS EMPREENDIMENTOS'!#REF!,IF(BH54='DADOS DOS EMPREENDIMENTOS'!#REF!,'DADOS DOS EMPREENDIMENTOS'!#REF!,BJ54*(1-'DADOS DOS EMPREENDIMENTOS'!#REF!-'DADOS DOS EMPREENDIMENTOS'!#REF!))))","v":{"$error":"#REF!"}},null,8,"2010-01-01",4.6099999744609189E-2,{"$f":"IF(BM54<'DADOS DOS EMPREENDIMENTOS'!BO$11,0,IF(BM54='DADOS DOS EMPREENDIMENTOS'!BO$11,SUM(BO$46:BO54)*(1-'DADOS DOS EMPREENDIMENTOS'!#REF!-'DADOS DOS EMPREENDIMENTOS'!#REF!)+'DADOS DOS EMPREENDIMENTOS'!#REF!,IF(BM54='DADOS DOS EMPREENDIMENTOS'!BO$12,'DADOS DOS EMPREENDIMENTOS'!#REF!,BO54*(1-'DADOS DOS EMPREENDIMENTOS'!#REF!-'DADOS DOS EMPREENDIMENTOS'!#REF!))))","v":{"$error":"#REF!"}},null,8,"2010-01-01",4.6099999744609189E-2,{"$f":"IF(BR54<'DADOS DOS EMPREENDIMENTOS'!BT$11,0,IF(BR54='DADOS DOS EMPREENDIMENTOS'!BT$11,SUM(BT$46:BT54)*(1-'DADOS DOS EMPREENDIMENTOS'!#REF!-'DADOS DOS EMPREENDIMENTOS'!#REF!)+'DADOS DOS EMPREENDIMENTOS'!#REF!,IF(BR54='DADOS DOS EMPREENDIMENTOS'!BT$12,'DADOS DOS EMPREENDIMENTOS'!#REF!,BT54*(1-'DADOS DOS EMPREENDIMENTOS'!#REF!-'DADOS DOS EMPREENDIMENTOS'!#REF!))))","v":{"$error":"#REF!"}},null,8,"2010-01-01",4.6099999744609189E-2,{"$f":"IF(BW54<'DADOS DOS EMPREENDIMENTOS'!BY$11,0,IF(BW54='DADOS DOS EMPREENDIMENTOS'!BY$11,SUM(BY$46:BY54)*(1-'DADOS DOS EMPREENDIMENTOS'!#REF!-'DADOS DOS EMPREENDIMENTOS'!#REF!)+'DADOS DOS EMPREENDIMENTOS'!#REF!,IF(BW54='DADOS DOS EMPREENDIMENTOS'!BY$12,'DADOS DOS EMPREENDIMENTOS'!#REF!,BY54*(1-'DADOS DOS EMPREENDIMENTOS'!#REF!-'DADOS DOS EMPREENDIMENTOS'!#REF!))))","v":{"$error":"#REF!"}},null,8,"2010-01-01",4.6099999744609189E-2,{"$f":"IF(CB54<'DADOS DOS EMPREENDIMENTOS'!CD$11,0,IF(CB54='DADOS DOS EMPREENDIMENTOS'!CD$11,SUM(CD$46:CD54)*(1-'DADOS DOS EMPREENDIMENTOS'!#REF!-'DADOS DOS EMPREENDIMENTOS'!#REF!)+'DADOS DOS EMPREENDIMENTOS'!#REF!,IF(CB54='DADOS DOS EMPREENDIMENTOS'!CD$12,'DADOS DOS EMPREENDIMENTOS'!#REF!,CD54*(1-'DADOS DOS EMPREENDIMENTOS'!#REF!-'DADOS DOS EMPREENDIMENTOS'!#REF!))))","v":{"$error":"#REF!"}}]
[null,null,null,null,null,null,null,null,null,null,null,null,null,null,9,null,null,null,null,9,null,null,null,null,9,null,null,null,null,9,"2010-02-01",4.5700000205209423E-2,{"$f":"IF(AD55<'DADOS DOS EMPREENDIMENTOS'!AF$11,0,IF(AD55='DADOS DOS EMPREENDIMENTOS'!AF$11,SUM(AF$46:AF55)*(1-'DADOS DOS EMPREENDIMENTOS'!#REF!-'DADOS DOS EMPREENDIMENTOS'!#REF!)+'DADOS DOS EMPREENDIMENTOS'!#REF!,IF(AD55='DADOS DOS EMPREENDIMENTOS'!#REF!,'DADOS DOS EMPREENDIMENTOS'!#REF!,AF55*(1-'DADOS DOS EMPREENDIMENTOS'!#REF!-'DADOS DOS EMPREENDIMENTOS'!#REF!))))","v":{"$error":"#REF!"}},null,9,"2010-02-01",4.5700000205209423E-2,{"$f":"IF(AI55<'DADOS DOS EMPREENDIMENTOS'!AK$11,0,IF(AI55='DADOS DOS EMPREENDIMENTOS'!AK$11,SUM(AK$46:AK55)*(1-'DADOS DOS EMPREENDIMENTOS'!#REF!-'DADOS DOS EMPREENDIMENTOS'!#REF!)+'DADOS DOS EMPREENDIMENTOS'!#REF!,IF(AI55='DADOS DOS EMPREENDIMENTOS'!#REF!,'DADOS DOS EMPREENDIMENTOS'!#REF!,AK55*(1-'DADOS DOS EMPREENDIMENTOS'!#REF!-'DADOS DOS EMPREENDIMENTOS'!#REF!))))","v":{"$error":"#REF!"}},null,9,"2010-02-01",4.5700000205209423E-2,{"$f":"IF(AN55<'DADOS DOS EMPREENDIMENTOS'!AP$11,0,IF(AN55='DADOS DOS EMPREENDIMENTOS'!AP$11,SUM(AP$46:AP55)*(1-'DADOS DOS EMPREENDIMENTOS'!#REF!-'DADOS DOS EMPREENDIMENTOS'!#REF!)+'DADOS DOS EMPREENDIMENTOS'!#REF!,IF(AN55='DADOS DOS EMPREENDIMENTOS'!#REF!,'DADOS DOS EMPREENDIMENTOS'!#REF!,AP55*(1-'DADOS DOS EMPREENDIMENTOS'!#REF!-'DADOS DOS EMPREENDIMENTOS'!#REF!))))","v":{"$error":"#REF!"}},null,9,"2010-02-01",4.5700000205209423E-2,{"$f":"IF(AS55<'DADOS DOS EMPREENDIMENTOS'!AU$11,0,IF(AS55='DADOS DOS EMPREENDIMENTOS'!AU$11,SUM(AU$46:AU55)*(1-'DADOS DOS EMPREENDIMENTOS'!#REF!-'DADOS DOS EMPREENDIMENTOS'!#REF!)+'DADOS DOS EMPREENDIMENTOS'!#REF!,IF(AS55='DADOS DOS EMPREENDIMENTOS'!#REF!,'DADOS DOS EMPREENDIMENTOS'!#REF!,AU55*(1-'DADOS DOS EMPREENDIMENTOS'!#REF!-'DADOS DOS EMPREENDIMENTOS'!#REF!))))","v":{"$error":"#REF!"}},null,9,"2010-02-01",4.5700000205209423E-2,{"$f":"IF(AX55<'DADOS DOS EMPREENDIMENTOS'!AZ$11,0,IF(AX55='DADOS DOS EMPREENDIMENTOS'!AZ$11,SUM(AZ$46:AZ55)*(1-'DADOS DOS EMPREENDIMENTOS'!#REF!-'DADOS DOS EMPREENDIMENTOS'!#REF!)+'DADOS DOS EMPREENDIMENTOS'!#REF!,IF(AX55='DADOS DOS EMPREENDIMENTOS'!#REF!,'DADOS DOS EMPREENDIMENTOS'!#REF!,AZ55*(1-'DADOS DOS EMPREENDIMENTOS'!#REF!-'DADOS DOS EMPREENDIMENTOS'!#REF!))))","v":{"$error":"#REF!"}},null,9,"2010-02-01",4.5700000205209423E-2,{"$f":"IF(BC55<'DADOS DOS EMPREENDIMENTOS'!BE$11,0,IF(BC55='DADOS DOS EMPREENDIMENTOS'!BE$11,SUM(BE$46:BE55)*(1-'DADOS DOS EMPREENDIMENTOS'!#REF!-'DADOS DOS EMPREENDIMENTOS'!#REF!)+'DADOS DOS EMPREENDIMENTOS'!#REF!,IF(BC55='DADOS DOS EMPREENDIMENTOS'!#REF!,'DADOS DOS EMPREENDIMENTOS'!#REF!,BE55*(1-'DADOS DOS EMPREENDIMENTOS'!#REF!-'DADOS DOS EMPREENDIMENTOS'!#REF!))))","v":{"$error":"#REF!"}},null,9,"2010-02-01",4.5700000205209423E-2,{"$f":"IF(BH55<'DADOS DOS EMPREENDIMENTOS'!BJ$11,0,IF(BH55='DADOS DOS EMPREENDIMENTOS'!BJ$11,SUM(BJ$46:BJ55)*(1-'DADOS DOS EMPREENDIMENTOS'!#REF!-'DADOS DOS EMPREENDIMENTOS'!#REF!)+'DADOS DOS EMPREENDIMENTOS'!#REF!,IF(BH55='DADOS DOS EMPREENDIMENTOS'!#REF!,'DADOS DOS EMPREENDIMENTOS'!#REF!,BJ55*(1-'DADOS DOS EMPREENDIMENTOS'!#REF!-'DADOS DOS EMPREENDIMENTOS'!#REF!))))","v":{"$error":"#REF!"}},null,9,"2010-02-01",4.5700000205209423E-2,{"$f":"IF(BM55<'DADOS DOS EMPREENDIMENTOS'!BO$11,0,IF(BM55='DADOS DOS EMPREENDIMENTOS'!BO$11,SUM(BO$46:BO55)*(1-'DADOS DOS EMPREENDIMENTOS'!#REF!-'DADOS DOS EMPREENDIMENTOS'!#REF!)+'DADOS DOS EMPREENDIMENTOS'!#REF!,IF(BM55='DADOS DOS EMPREENDIMENTOS'!BO$12,'DADOS DOS EMPREENDIMENTOS'!#REF!,BO55*(1-'DADOS DOS EMPREENDIMENTOS'!#REF!-'DADOS DOS EMPREENDIMENTOS'!#REF!))))","v":{"$error":"#REF!"}},null,9,"2010-02-01",4.5700000205209423E-2,{"$f":"IF(BR55<'DADOS DOS EMPREENDIMENTOS'!BT$11,0,IF(BR55='DADOS DOS EMPREENDIMENTOS'!BT$11,SUM(BT$46:BT55)*(1-'DADOS DOS EMPREENDIMENTOS'!#REF!-'DADOS DOS EMPREENDIMENTOS'!#REF!)+'DADOS DOS EMPREENDIMENTOS'!#REF!,IF(BR55='DADOS DOS EMPREENDIMENTOS'!BT$12,'DADOS DOS EMPREENDIMENTOS'!#REF!,BT55*(1-'DADOS DOS EMPREENDIMENTOS'!#REF!-'DADOS DOS EMPREENDIMENTOS'!#REF!))))","v":{"$error":"#REF!"}},null,9,"2010-02-01",4.5700000205209423E-2,{"$f":"IF(BW55<'DADOS DOS EMPREENDIMENTOS'!BY$11,0,IF(BW55='DADOS DOS EMPREENDIMENTOS'!BY$11,SUM(BY$46:BY55)*(1-'DADOS DOS EMPREENDIMENTOS'!#REF!-'DADOS DOS EMPREENDIMENTOS'!#REF!)+'DADOS DOS EMPREENDIMENTOS'!#REF!,IF(BW55='DADOS DOS EMPREENDIMENTOS'!BY$12,'DADOS DOS EMPREENDIMENTOS'!#REF!,BY55*(1-'DADOS DOS EMPREENDIMENTOS'!#REF!-'DADOS DOS EMPREENDIMENTOS'!#REF!))))","v":{"$error":"#REF!"}},null,9,"2010-02-01",4.5700000205209423E-2,{"$f":"IF(CB55<'DADOS DOS EMPREENDIMENTOS'!CD$11,0,IF(CB55='DADOS DOS EMPREENDIMENTOS'!CD$11,SUM(CD$46:CD55)*(1-'DADOS DOS EMPREENDIMENTOS'!#REF!-'DADOS DOS EMPREENDIMENTOS'!#REF!)+'DADOS DOS EMPREENDIMENTOS'!#REF!,IF(CB55='DADOS DOS EMPREENDIMENTOS'!CD$12,'DADOS DOS EMPREENDIMENTOS'!#REF!,CD55*(1-'DADOS DOS EMPREENDIMENTOS'!#REF!-'DADOS DOS EMPREENDIMENTOS'!#REF!))))","v":{"$error":"#REF!"}}]
[null,null,null,null,null,null,null,null,null,null,null,null,null,null,10,null,null,null,null,10,null,null,null,null,10,null,null,null,null,10,"2010-03-01",4.9899999900495845E-2,{"$f":"IF(AD56<'DADOS DOS EMPREENDIMENTOS'!AF$11,0,IF(AD56='DADOS DOS EMPREENDIMENTOS'!AF$11,SUM(AF$46:AF56)*(1-'DADOS DOS EMPREENDIMENTOS'!#REF!-'DADOS DOS EMPREENDIMENTOS'!#REF!)+'DADOS DOS EMPREENDIMENTOS'!#REF!,IF(AD56='DADOS DOS EMPREENDIMENTOS'!#REF!,'DADOS DOS EMPREENDIMENTOS'!#REF!,AF56*(1-'DADOS DOS EMPREENDIMENTOS'!#REF!-'DADOS DOS EMPREENDIMENTOS'!#REF!))))","v":{"$error":"#REF!"}},null,10,"2010-03-01",4.9899999900495845E-2,{"$f":"IF(AI56<'DADOS DOS EMPREENDIMENTOS'!AK$11,0,IF(AI56='DADOS DOS EMPREENDIMENTOS'!AK$11,SUM(AK$46:AK56)*(1-'DADOS DOS EMPREENDIMENTOS'!#REF!-'DADOS DOS EMPREENDIMENTOS'!#REF!)+'DADOS DOS EMPREENDIMENTOS'!#REF!,IF(AI56='DADOS DOS EMPREENDIMENTOS'!#REF!,'DADOS DOS EMPREENDIMENTOS'!#REF!,AK56*(1-'DADOS DOS EMPREENDIMENTOS'!#REF!-'DADOS DOS EMPREENDIMENTOS'!#REF!))))","v":{"$error":"#REF!"}},null,10,"2010-03-01",4.9899999900495845E-2,{"$f":"IF(AN56<'DADOS DOS EMPREENDIMENTOS'!AP$11,0,IF(AN56='DADOS DOS EMPREENDIMENTOS'!AP$11,SUM(AP$46:AP56)*(1-'DADOS DOS EMPREENDIMENTOS'!#REF!-'DADOS DOS EMPREENDIMENTOS'!#REF!)+'DADOS DOS EMPREENDIMENTOS'!#REF!,IF(AN56='DADOS DOS EMPREENDIMENTOS'!#REF!,'DADOS DOS EMPREENDIMENTOS'!#REF!,AP56*(1-'DADOS DOS EMPREENDIMENTOS'!#REF!-'DADOS DOS EMPREENDIMENTOS'!#REF!))))","v":{"$error":"#REF!"}},null,10,"2010-03-01",4.9899999900495845E-2,{"$f":"IF(AS56<'DADOS DOS EMPREENDIMENTOS'!AU$11,0,IF(AS56='DADOS DOS EMPREENDIMENTOS'!AU$11,SUM(AU$46:AU56)*(1-'DADOS DOS EMPREENDIMENTOS'!#REF!-'DADOS DOS EMPREENDIMENTOS'!#REF!)+'DADOS DOS EMPREENDIMENTOS'!#REF!,IF(AS56='DADOS DOS EMPREENDIMENTOS'!#REF!,'DADOS DOS EMPREENDIMENTOS'!#REF!,AU56*(1-'DADOS DOS EMPREENDIMENTOS'!#REF!-'DADOS DOS EMPREENDIMENTOS'!#REF!))))","v":{"$error":"#REF!"}},null,10,"2010-03-01",4.9899999900495845E-2,{"$f":"IF(AX56<'DADOS DOS EMPREENDIMENTOS'!AZ$11,0,IF(AX56='DADOS DOS EMPREENDIMENTOS'!AZ$11,SUM(AZ$46:AZ56)*(1-'DADOS DOS EMPREENDIMENTOS'!#REF!-'DADOS DOS EMPREENDIMENTOS'!#REF!)+'DADOS DOS EMPREENDIMENTOS'!#REF!,IF(AX56='DADOS DOS EMPREENDIMENTOS'!#REF!,'DADOS DOS EMPREENDIMENTOS'!#REF!,AZ56*(1-'DADOS DOS EMPREENDIMENTOS'!#REF!-'DADOS DOS EMPREENDIMENTOS'!#REF!))))","v":{"$error":"#REF!"}},null,10,"2010-03-01",4.9899999900495845E-2,{"$f":"IF(BC56<'DADOS DOS EMPREENDIMENTOS'!BE$11,0,IF(BC56='DADOS DOS EMPREENDIMENTOS'!BE$11,SUM(BE$46:BE56)*(1-'DADOS DOS EMPREENDIMENTOS'!#REF!-'DADOS DOS EMPREENDIMENTOS'!#REF!)+'DADOS DOS EMPREENDIMENTOS'!#REF!,IF(BC56='DADOS DOS EMPREENDIMENTOS'!#REF!,'DADOS DOS EMPREENDIMENTOS'!#REF!,BE56*(1-'DADOS DOS EMPREENDIMENTOS'!#REF!-'DADOS DOS EMPREENDIMENTOS'!#REF!))))","v":{"$error":"#REF!"}},null,10,"2010-03-01",4.9899999900495845E-2,{"$f":"IF(BH56<'DADOS DOS EMPREENDIMENTOS'!BJ$11,0,IF(BH56='DADOS DOS EMPREENDIMENTOS'!BJ$11,SUM(BJ$46:BJ56)*(1-'DADOS DOS EMPREENDIMENTOS'!#REF!-'DADOS DOS EMPREENDIMENTOS'!#REF!)+'DADOS DOS EMPREENDIMENTOS'!#REF!,IF(BH56='DADOS DOS EMPREENDIMENTOS'!#REF!,'DADOS DOS EMPREENDIMENTOS'!#REF!,BJ56*(1-'DADOS DOS EMPREENDIMENTOS'!#REF!-'DADOS DOS EMPREENDIMENTOS'!#REF!))))","v":{"$error":"#REF!"}},null,10,"2010-03-01",4.9899999900495845E-2,{"$f":"IF(BM56<'DADOS DOS EMPREENDIMENTOS'!BO$11,0,IF(BM56='DADOS DOS EMPREENDIMENTOS'!BO$11,SUM(BO$46:BO56)*(1-'DADOS DOS EMPREENDIMENTOS'!#REF!-'DADOS DOS EMPREENDIMENTOS'!#REF!)+'DADOS DOS EMPREENDIMENTOS'!#REF!,IF(BM56='DADOS DOS EMPREENDIMENTOS'!BO$12,'DADOS DOS EMPREENDIMENTOS'!#REF!,BO56*(1-'DADOS DOS EMPREENDIMENTOS'!#REF!-'DADOS DOS EMPREENDIMENTOS'!#REF!))))","v":{"$error":"#REF!"}},null,10,"2010-03-01",4.9899999900495845E-2,{"$f":"IF(BR56<'DADOS DOS EMPREENDIMENTOS'!BT$11,0,IF(BR56='DADOS DOS EMPREENDIMENTOS'!BT$11,SUM(BT$46:BT56)*(1-'DADOS DOS EMPREENDIMENTOS'!#REF!-'DADOS DOS EMPREENDIMENTOS'!#REF!)+'DADOS DOS EMPREENDIMENTOS'!#REF!,IF(BR56='DADOS DOS EMPREENDIMENTOS'!BT$12,'DADOS DOS EMPREENDIMENTOS'!#REF!,BT56*(1-'DADOS DOS EMPREENDIMENTOS'!#REF!-'DADOS DOS EMPREENDIMENTOS'!#REF!))))","v":{"$error":"#REF!"}},null,10,"2010-03-01",4.9899999900495845E-2,{"$f":"IF(BW56<'DADOS DOS EMPREENDIMENTOS'!BY$11,0,IF(BW56='DADOS DOS EMPREENDIMENTOS'!BY$11,SUM(BY$46:BY56)*(1-'DADOS DOS EMPREENDIMENTOS'!#REF!-'DADOS DOS EMPREENDIMENTOS'!#REF!)+'DADOS DOS EMPREENDIMENTOS'!#REF!,IF(BW56='DADOS DOS EMPREENDIMENTOS'!BY$12,'DADOS DOS EMPREENDIMENTOS'!#REF!,BY56*(1-'DADOS DOS EMPREENDIMENTOS'!#REF!-'DADOS DOS EMPREENDIMENTOS'!#REF!))))","v":{"$error":"#REF!"}},null,10,"2010-03-01",4.9899999900495845E-2,{"$f":"IF(CB56<'DADOS DOS EMPREENDIMENTOS'!CD$11,0,IF(CB56='DADOS DOS EMPREENDIMENTOS'!CD$11,SUM(CD$46:CD56)*(1-'DADOS DOS EMPREENDIMENTOS'!#REF!-'DADOS DOS EMPREENDIMENTOS'!#REF!)+'DADOS DOS EMPREENDIMENTOS'!#REF!,IF(CB56='DADOS DOS EMPREENDIMENTOS'!CD$12,'DADOS DOS EMPREENDIMENTOS'!#REF!,CD56*(1-'DADOS DOS EMPREENDIMENTOS'!#REF!-'DADOS DOS EMPREENDIMENTOS'!#REF!))))","v":{"$error":"#REF!"}}]
[null,null,null,null,null,null,null,null,null,null,null,null,null,null,11,null,null,null,null,11,null,null,null,null,11,null,null,null,null,11,"2010-04-01",5.7199999961457637E-2,{"$f":"IF(AD57<'DADOS DOS EMPREENDIMENTOS'!AF$11,0,IF(AD57='DADOS DOS EMPREENDIMENTOS'!AF$11,SUM(AF$46:AF57)*(1-'DADOS DOS EMPREENDIMENTOS'!#REF!-'DADOS DOS EMPREENDIMENTOS'!#REF!)+'DADOS DOS EMPREENDIMENTOS'!#REF!,IF(AD57='DADOS DOS EMPREENDIMENTOS'!#REF!,'DADOS DOS EMPREENDIMENTOS'!#REF!,AF57*(1-'DADOS DOS EMPREENDIMENTOS'!#REF!-'DADOS DOS EMPREENDIMENTOS'!#REF!))))","v":{"$error":"#REF!"}},null,11,"2010-04-01",5.7199999961457637E-2,{"$f":"IF(AI57<'DADOS DOS EMPREENDIMENTOS'!AK$11,0,IF(AI57='DADOS DOS EMPREENDIMENTOS'!AK$11,SUM(AK$46:AK57)*(1-'DADOS DOS EMPREENDIMENTOS'!#REF!-'DADOS DOS EMPREENDIMENTOS'!#REF!)+'DADOS DOS EMPREENDIMENTOS'!#REF!,IF(AI57='DADOS DOS EMPREENDIMENTOS'!#REF!,'DADOS DOS EMPREENDIMENTOS'!#REF!,AK57*(1-'DADOS DOS EMPREENDIMENTOS'!#REF!-'DADOS DOS EMPREENDIMENTOS'!#REF!))))","v":{"$error":"#REF!"}},null,11,"2010-04-01",5.7199999961457637E-2,{"$f":"IF(AN57<'DADOS DOS EMPREENDIMENTOS'!AP$11,0,IF(AN57='DADOS DOS EMPREENDIMENTOS'!AP$11,SUM(AP$46:AP57)*(1-'DADOS DOS EMPREENDIMENTOS'!#REF!-'DADOS DOS EMPREENDIMENTOS'!#REF!)+'DADOS DOS EMPREENDIMENTOS'!#REF!,IF(AN57='DADOS DOS EMPREENDIMENTOS'!#REF!,'DADOS DOS EMPREENDIMENTOS'!#REF!,AP57*(1-'DADOS DOS EMPREENDIMENTOS'!#REF!-'DADOS DOS EMPREENDIMENTOS'!#REF!))))","v":{"$error":"#REF!"}},null,11,"2010-04-01",5.7199999961457637E-2,{"$f":"IF(AS57<'DADOS DOS EMPREENDIMENTOS'!AU$11,0,IF(AS57='DADOS DOS EMPREENDIMENTOS'!AU$11,SUM(AU$46:AU57)*(1-'DADOS DOS EMPREENDIMENTOS'!#REF!-'DADOS DOS EMPREENDIMENTOS'!#REF!)+'DADOS DOS EMPREENDIMENTOS'!#REF!,IF(AS57='DADOS DOS EMPREENDIMENTOS'!#REF!,'DADOS DOS EMPREENDIMENTOS'!#REF!,AU57*(1-'DADOS DOS EMPREENDIMENTOS'!#REF!-'DADOS DOS EMPREENDIMENTOS'!#REF!))))","v":{"$error":"#REF!"}},null,11,"2010-04-01",5.7199999961457637E-2,{"$f":"IF(AX57<'DADOS DOS EMPREENDIMENTOS'!AZ$11,0,IF(AX57='DADOS DOS EMPREENDIMENTOS'!AZ$11,SUM(AZ$46:AZ57)*(1-'DADOS DOS EMPREENDIMENTOS'!#REF!-'DADOS DOS EMPREENDIMENTOS'!#REF!)+'DADOS DOS EMPREENDIMENTOS'!#REF!,IF(AX57='DADOS DOS EMPREENDIMENTOS'!#REF!,'DADOS DOS EMPREENDIMENTOS'!#REF!,AZ57*(1-'DADOS DOS EMPREENDIMENTOS'!#REF!-'DADOS DOS EMPREENDIMENTOS'!#REF!))))","v":{"$error":"#REF!"}},null,11,"2010-04-01",5.7199999961457637E-2,{"$f":"IF(BC57<'DADOS DOS EMPREENDIMENTOS'!BE$11,0,IF(BC57='DADOS DOS EMPREENDIMENTOS'!BE$11,SUM(BE$46:BE57)*(1-'DADOS DOS EMPREENDIMENTOS'!#REF!-'DADOS DOS EMPREENDIMENTOS'!#REF!)+'DADOS DOS EMPREENDIMENTOS'!#REF!,IF(BC57='DADOS DOS EMPREENDIMENTOS'!#REF!,'DADOS DOS EMPREENDIMENTOS'!#REF!,BE57*(1-'DADOS DOS EMPREENDIMENTOS'!#REF!-'DADOS DOS EMPREENDIMENTOS'!#REF!))))","v":{"$error":"#REF!"}},null,11,"2010-04-01",5.7199999961457637E-2,{"$f":"IF(BH57<'DADOS DOS EMPREENDIMENTOS'!BJ$11,0,IF(BH57='DADOS DOS EMPREENDIMENTOS'!BJ$11,SUM(BJ$46:BJ57)*(1-'DADOS DOS EMPREENDIMENTOS'!#REF!-'DADOS DOS EMPREENDIMENTOS'!#REF!)+'DADOS DOS EMPREENDIMENTOS'!#REF!,IF(BH57='DADOS DOS EMPREENDIMENTOS'!#REF!,'DADOS DOS EMPREENDIMENTOS'!#REF!,BJ57*(1-'DADOS DOS EMPREENDIMENTOS'!#REF!-'DADOS DOS EMPREENDIMENTOS'!#REF!))))","v":{"$error":"#REF!"}},null,11,"2010-04-01",5.7199999961457637E-2,{"$f":"IF(BM57<'DADOS DOS EMPREENDIMENTOS'!BO$11,0,IF(BM57='DADOS DOS EMPREENDIMENTOS'!BO$11,SUM(BO$46:BO57)*(1-'DADOS DOS EMPREENDIMENTOS'!#REF!-'DADOS DOS EMPREENDIMENTOS'!#REF!)+'DADOS DOS EMPREENDIMENTOS'!#REF!,IF(BM57='DADOS DOS EMPREENDIMENTOS'!BO$12,'DADOS DOS EMPREENDIMENTOS'!#REF!,BO57*(1-'DADOS DOS EMPREENDIMENTOS'!#REF!-'DADOS DOS EMPREENDIMENTOS'!#REF!))))","v":{"$error":"#REF!"}},null,11,"2010-04-01",5.7199999961457637E-2,{"$f":"IF(BR57<'DADOS DOS EMPREENDIMENTOS'!BT$11,0,IF(BR57='DADOS DOS EMPREENDIMENTOS'!BT$11,SUM(BT$46:BT57)*(1-'DADOS DOS EMPREENDIMENTOS'!#REF!-'DADOS DOS EMPREENDIMENTOS'!#REF!)+'DADOS DOS EMPREENDIMENTOS'!#REF!,IF(BR57='DADOS DOS EMPREENDIMENTOS'!BT$12,'DADOS DOS EMPREENDIMENTOS'!#REF!,BT57*(1-'DADOS DOS EMPREENDIMENTOS'!#REF!-'DADOS DOS EMPREENDIMENTOS'!#REF!))))","v":{"$error":"#REF!"}},null,11,"2010-04-01",5.7199999961457637E-2,{"$f":"IF(BW57<'DADOS DOS EMPREENDIMENTOS'!BY$11,0,IF(BW57='DADOS DOS EMPREENDIMENTOS'!BY$11,SUM(BY$46:BY57)*(1-'DADOS DOS EMPREENDIMENTOS'!#REF!-'DADOS DOS EMPREENDIMENTOS'!#REF!)+'DADOS DOS EMPREENDIMENTOS'!#REF!,IF(BW57='DADOS DOS EMPREENDIMENTOS'!BY$12,'DADOS DOS EMPREENDIMENTOS'!#REF!,BY57*(1-'DADOS DOS EMPREENDIMENTOS'!#REF!-'DADOS DOS EMPREENDIMENTOS'!#REF!))))","v":{"$error":"#REF!"}},null,11,"2010-04-01",5.7199999961457637E-2,{"$f":"IF(CB57<'DADOS DOS EMPREENDIMENTOS'!CD$11,0,IF(CB57='DADOS DOS EMPREENDIMENTOS'!CD$11,SUM(CD$46:CD57)*(1-'DADOS DOS EMPREENDIMENTOS'!#REF!-'DADOS DOS EMPREENDIMENTOS'!#REF!)+'DADOS DOS EMPREENDIMENTOS'!#REF!,IF(CB57='DADOS DOS EMPREENDIMENTOS'!CD$12,'DADOS DOS EMPREENDIMENTOS'!#REF!,CD57*(1-'DADOS DOS EMPREENDIMENTOS'!#REF!-'DADOS DOS EMPREENDIMENTOS'!#REF!))))","v":{"$error":"#REF!"}}]
[null,null,null,null,null,null,null,null,null,null,null,null,null,null,12,null,null,null,null,12,null,null,null,null,12,null,null,null,null,12,"2010-05-01",6.7300000137283295E-2,{"$f":"IF(AD58<'DADOS DOS EMPREENDIMENTOS'!AF$11,0,IF(AD58='DADOS DOS EMPREENDIMENTOS'!AF$11,SUM(AF$46:AF58)*(1-'DADOS DOS EMPREENDIMENTOS'!#REF!-'DADOS DOS EMPREENDIMENTOS'!#REF!)+'DADOS DOS EMPREENDIMENTOS'!#REF!,IF(AD58='DADOS DOS EMPREENDIMENTOS'!#REF!,'DADOS DOS EMPREENDIMENTOS'!#REF!,AF58*(1-'DADOS DOS EMPREENDIMENTOS'!#REF!-'DADOS DOS EMPREENDIMENTOS'!#REF!))))","v":{"$error":"#REF!"}},null,12,"2010-05-01",6.7300000137283295E-2,{"$f":"IF(AI58<'DADOS DOS EMPREENDIMENTOS'!AK$11,0,IF(AI58='DADOS DOS EMPREENDIMENTOS'!AK$11,SUM(AK$46:AK58)*(1-'DADOS DOS EMPREENDIMENTOS'!#REF!-'DADOS DOS EMPREENDIMENTOS'!#REF!)+'DADOS DOS EMPREENDIMENTOS'!#REF!,IF(AI58='DADOS DOS EMPREENDIMENTOS'!#REF!,'DADOS DOS EMPREENDIMENTOS'!#REF!,AK58*(1-'DADOS DOS EMPREENDIMENTOS'!#REF!-'DADOS DOS EMPREENDIMENTOS'!#REF!))))","v":{"$error":"#REF!"}},null,12,"2010-05-01",6.7300000137283295E-2,{"$f":"IF(AN58<'DADOS DOS EMPREENDIMENTOS'!AP$11,0,IF(AN58='DADOS DOS EMPREENDIMENTOS'!AP$11,SUM(AP$46:AP58)*(1-'DADOS DOS EMPREENDIMENTOS'!#REF!-'DADOS DOS EMPREENDIMENTOS'!#REF!)+'DADOS DOS EMPREENDIMENTOS'!#REF!,IF(AN58='DADOS DOS EMPREENDIMENTOS'!#REF!,'DADOS DOS EMPREENDIMENTOS'!#REF!,AP58*(1-'DADOS DOS EMPREENDIMENTOS'!#REF!-'DADOS DOS EMPREENDIMENTOS'!#REF!))))","v":{"$error":"#REF!"}},null,12,"2010-05-01",6.7300000137283295E-2,{"$f":"IF(AS58<'DADOS DOS EMPREENDIMENTOS'!AU$11,0,IF(AS58='DADOS DOS EMPREENDIMENTOS'!AU$11,SUM(AU$46:AU58)*(1-'DADOS DOS EMPREENDIMENTOS'!#REF!-'DADOS DOS EMPREENDIMENTOS'!#REF!)+'DADOS DOS EMPREENDIMENTOS'!#REF!,IF(AS58='DADOS DOS EMPREENDIMENTOS'!#REF!,'DADOS DOS EMPREENDIMENTOS'!#REF!,AU58*(1-'DADOS DOS EMPREENDIMENTOS'!#REF!-'DADOS DOS EMPREENDIMENTOS'!#REF!))))","v":{"$error":"#REF!"}},null,12,"2010-05-01",6.7300000137283295E-2,{"$f":"IF(AX58<'DADOS DOS EMPREENDIMENTOS'!AZ$11,0,IF(AX58='DADOS DOS EMPREENDIMENTOS'!AZ$11,SUM(AZ$46:AZ58)*(1-'DADOS DOS EMPREENDIMENTOS'!#REF!-'DADOS DOS EMPREENDIMENTOS'!#REF!)+'DADOS DOS EMPREENDIMENTOS'!#REF!,IF(AX58='DADOS DOS EMPREENDIMENTOS'!#REF!,'DADOS DOS EMPREENDIMENTOS'!#REF!,AZ58*(1-'DADOS DOS EMPREENDIMENTOS'!#REF!-'DADOS DOS EMPREENDIMENTOS'!#REF!))))","v":{"$error":"#REF!"}},null,12,"2010-05-01",6.7300000137283295E-2,{"$f":"IF(BC58<'DADOS DOS EMPREENDIMENTOS'!BE$11,0,IF(BC58='DADOS DOS EMPREENDIMENTOS'!BE$11,SUM(BE$46:BE58)*(1-'DADOS DOS EMPREENDIMENTOS'!#REF!-'DADOS DOS EMPREENDIMENTOS'!#REF!)+'DADOS DOS EMPREENDIMENTOS'!#REF!,IF(BC58='DADOS DOS EMPREENDIMENTOS'!#REF!,'DADOS DOS EMPREENDIMENTOS'!#REF!,BE58*(1-'DADOS DOS EMPREENDIMENTOS'!#REF!-'DADOS DOS EMPREENDIMENTOS'!#REF!))))","v":{"$error":"#REF!"}},null,12,"2010-05-01",6.7300000137283295E-2,{"$f":"IF(BH58<'DADOS DOS EMPREENDIMENTOS'!BJ$11,0,IF(BH58='DADOS DOS EMPREENDIMENTOS'!BJ$11,SUM(BJ$46:BJ58)*(1-'DADOS DOS EMPREENDIMENTOS'!#REF!-'DADOS DOS EMPREENDIMENTOS'!#REF!)+'DADOS DOS EMPREENDIMENTOS'!#REF!,IF(BH58='DADOS DOS EMPREENDIMENTOS'!#REF!,'DADOS DOS EMPREENDIMENTOS'!#REF!,BJ58*(1-'DADOS DOS EMPREENDIMENTOS'!#REF!-'DADOS DOS EMPREENDIMENTOS'!#REF!))))","v":{"$error":"#REF!"}},null,12,"2010-05-01",6.7300000137283295E-2,{"$f":"IF(BM58<'DADOS DOS EMPREENDIMENTOS'!BO$11,0,IF(BM58='DADOS DOS EMPREENDIMENTOS'!BO$11,SUM(BO$46:BO58)*(1-'DADOS DOS EMPREENDIMENTOS'!#REF!-'DADOS DOS EMPREENDIMENTOS'!#REF!)+'DADOS DOS EMPREENDIMENTOS'!#REF!,IF(BM58='DADOS DOS EMPREENDIMENTOS'!BO$12,'DADOS DOS EMPREENDIMENTOS'!#REF!,BO58*(1-'DADOS DOS EMPREENDIMENTOS'!#REF!-'DADOS DOS EMPREENDIMENTOS'!#REF!))))","v":{"$error":"#REF!"}},null,12,"2010-05-01",6.7300000137283295E-2,{"$f":"IF(BR58<'DADOS DOS EMPREENDIMENTOS'!BT$11,0,IF(BR58='DADOS DOS EMPREENDIMENTOS'!BT$11,SUM(BT$46:BT58)*(1-'DADOS DOS EMPREENDIMENTOS'!#REF!-'DADOS DOS EMPREENDIMENTOS'!#REF!)+'DADOS DOS EMPREENDIMENTOS'!#REF!,IF(BR58='DADOS DOS EMPREENDIMENTOS'!BT$12,'DADOS DOS EMPREENDIMENTOS'!#REF!,BT58*(1-'DADOS DOS EMPREENDIMENTOS'!#REF!-'DADOS DOS EMPREENDIMENTOS'!#REF!))))","v":{"$error":"#REF!"}},null,12,"2010-05-01",6.7300000137283295E-2,{"$f":"IF(BW58<'DADOS DOS EMPREENDIMENTOS'!BY$11,0,IF(BW58='DADOS DOS EMPREENDIMENTOS'!BY$11,SUM(BY$46:BY58)*(1-'DADOS DOS EMPREENDIMENTOS'!#REF!-'DADOS DOS EMPREENDIMENTOS'!#REF!)+'DADOS DOS EMPREENDIMENTOS'!#REF!,IF(BW58='DADOS DOS EMPREENDIMENTOS'!BY$12,'DADOS DOS EMPREENDIMENTOS'!#REF!,BY58*(1-'DADOS DOS EMPREENDIMENTOS'!#REF!-'DADOS DOS EMPREENDIMENTOS'!#REF!))))","v":{"$error":"#REF!"}},null,12,"2010-05-01",6.7300000137283295E-2,{"$f":"IF(CB58<'DADOS DOS EMPREENDIMENTOS'!CD$11,0,IF(CB58='DADOS DOS EMPREENDIMENTOS'!CD$11,SUM(CD$46:CD58)*(1-'DADOS DOS EMPREENDIMENTOS'!#REF!-'DADOS DOS EMPREENDIMENTOS'!#REF!)+'DADOS DOS EMPREENDIMENTOS'!#REF!,IF(CB58='DADOS DOS EMPREENDIMENTOS'!CD$12,'DADOS DOS EMPREENDIMENTOS'!#REF!,CD58*(1-'DADOS DOS EMPREENDIMENTOS'!#REF!-'DADOS DOS EMPREENDIMENTOS'!#REF!))))","v":{"$error":"#REF!"}}]
[null,null,null,null,null,null,null,null,null,null,null,null,null,null,13,null,null,null,null,13,null,null,null,null,13,null,null,null,null,13,"2010-06-01",8.6299999962697868E-2,{"$f":"IF(AD59<'DADOS DOS EMPREENDIMENTOS'!AF$11,0,IF(AD59='DADOS DOS EMPREENDIMENTOS'!AF$11,SUM(AF$46:AF59)*(1-'DADOS DOS EMPREENDIMENTOS'!#REF!-'DADOS DOS EMPREENDIMENTOS'!#REF!)+'DADOS DOS EMPREENDIMENTOS'!#REF!,IF(AD59='DADOS DOS EMPREENDIMENTOS'!#REF!,'DADOS DOS EMPREENDIMENTOS'!#REF!,AF59*(1-'DADOS DOS EMPREENDIMENTOS'!#REF!-'DADOS DOS EMPREENDIMENTOS'!#REF!))))","v":{"$error":"#REF!"}},null,13,"2010-06-01",8.6299999962697868E-2,{"$f":"IF(AI59<'DADOS DOS EMPREENDIMENTOS'!AK$11,0,IF(AI59='DADOS DOS EMPREENDIMENTOS'!AK$11,SUM(AK$46:AK59)*(1-'DADOS DOS EMPREENDIMENTOS'!#REF!-'DADOS DOS EMPREENDIMENTOS'!#REF!)+'DADOS DOS EMPREENDIMENTOS'!#REF!,IF(AI59='DADOS DOS EMPREENDIMENTOS'!#REF!,'DADOS DOS EMPREENDIMENTOS'!#REF!,AK59*(1-'DADOS DOS EMPREENDIMENTOS'!#REF!-'DADOS DOS EMPREENDIMENTOS'!#REF!))))","v":{"$error":"#REF!"}},null,13,"2010-06-01",8.6299999962697868E-2,{"$f":"IF(AN59<'DADOS DOS EMPREENDIMENTOS'!AP$11,0,IF(AN59='DADOS DOS EMPREENDIMENTOS'!AP$11,SUM(AP$46:AP59)*(1-'DADOS DOS EMPREENDIMENTOS'!#REF!-'DADOS DOS EMPREENDIMENTOS'!#REF!)+'DADOS DOS EMPREENDIMENTOS'!#REF!,IF(AN59='DADOS DOS EMPREENDIMENTOS'!#REF!,'DADOS DOS EMPREENDIMENTOS'!#REF!,AP59*(1-'DADOS DOS EMPREENDIMENTOS'!#REF!-'DADOS DOS EMPREENDIMENTOS'!#REF!))))","v":{"$error":"#REF!"}},null,13,"2010-06-01",8.6299999962697868E-2,{"$f":"IF(AS59<'DADOS DOS EMPREENDIMENTOS'!AU$11,0,IF(AS59='DADOS DOS EMPREENDIMENTOS'!AU$11,SUM(AU$46:AU59)*(1-'DADOS DOS EMPREENDIMENTOS'!#REF!-'DADOS DOS EMPREENDIMENTOS'!#REF!)+'DADOS DOS EMPREENDIMENTOS'!#REF!,IF(AS59='DADOS DOS EMPREENDIMENTOS'!#REF!,'DADOS DOS EMPREENDIMENTOS'!#REF!,AU59*(1-'DADOS DOS EMPREENDIMENTOS'!#REF!-'DADOS DOS EMPREENDIMENTOS'!#REF!))))","v":{"$error":"#REF!"}},null,13,"2010-06-01",8.6299999962697868E-2,{"$f":"IF(AX59<'DADOS DOS EMPREENDIMENTOS'!AZ$11,0,IF(AX59='DADOS DOS EMPREENDIMENTOS'!AZ$11,SUM(AZ$46:AZ59)*(1-'DADOS DOS EMPREENDIMENTOS'!#REF!-'DADOS DOS EMPREENDIMENTOS'!#REF!)+'DADOS DOS EMPREENDIMENTOS'!#REF!,IF(AX59='DADOS DOS EMPREENDIMENTOS'!#REF!,'DADOS DOS EMPREENDIMENTOS'!#REF!,AZ59*(1-'DADOS DOS EMPREENDIMENTOS'!#REF!-'DADOS DOS EMPREENDIMENTOS'!#REF!))))","v":{"$error":"#REF!"}},null,13,"2010-06-01",8.6299999962697868E-2,{"$f":"IF(BC59<'DADOS DOS EMPREENDIMENTOS'!BE$11,0,IF(BC59='DADOS DOS EMPREENDIMENTOS'!BE$11,SUM(BE$46:BE59)*(1-'DADOS DOS EMPREENDIMENTOS'!#REF!-'DADOS DOS EMPREENDIMENTOS'!#REF!)+'DADOS DOS EMPREENDIMENTOS'!#REF!,IF(BC59='DADOS DOS EMPREENDIMENTOS'!#REF!,'DADOS DOS EMPREENDIMENTOS'!#REF!,BE59*(1-'DADOS DOS EMPREENDIMENTOS'!#REF!-'DADOS DOS EMPREENDIMENTOS'!#REF!))))","v":{"$error":"#REF!"}},null,13,"2010-06-01",8.6299999962697868E-2,{"$f":"IF(BH59<'DADOS DOS EMPREENDIMENTOS'!BJ$11,0,IF(BH59='DADOS DOS EMPREENDIMENTOS'!BJ$11,SUM(BJ$46:BJ59)*(1-'DADOS DOS EMPREENDIMENTOS'!#REF!-'DADOS DOS EMPREENDIMENTOS'!#REF!)+'DADOS DOS EMPREENDIMENTOS'!#REF!,IF(BH59='DADOS DOS EMPREENDIMENTOS'!#REF!,'DADOS DOS EMPREENDIMENTOS'!#REF!,BJ59*(1-'DADOS DOS EMPREENDIMENTOS'!#REF!-'DADOS DOS EMPREENDIMENTOS'!#REF!))))","v":{"$error":"#REF!"}},null,13,"2010-06-01",8.6299999962697868E-2,{"$f":"IF(BM59<'DADOS DOS EMPREENDIMENTOS'!BO$11,0,IF(BM59='DADOS DOS EMPREENDIMENTOS'!BO$11,SUM(BO$46:BO59)*(1-'DADOS DOS EMPREENDIMENTOS'!#REF!-'DADOS DOS EMPREENDIMENTOS'!#REF!)+'DADOS DOS EMPREENDIMENTOS'!#REF!,IF(BM59='DADOS DOS EMPREENDIMENTOS'!BO$12,'DADOS DOS EMPREENDIMENTOS'!#REF!,BO59*(1-'DADOS DOS EMPREENDIMENTOS'!#REF!-'DADOS DOS EMPREENDIMENTOS'!#REF!))))","v":{"$error":"#REF!"}},null,13,"2010-06-01",8.6299999962697868E-2,{"$f":"IF(BR59<'DADOS DOS EMPREENDIMENTOS'!BT$11,0,IF(BR59='DADOS DOS EMPREENDIMENTOS'!BT$11,SUM(BT$46:BT59)*(1-'DADOS DOS EMPREENDIMENTOS'!#REF!-'DADOS DOS EMPREENDIMENTOS'!#REF!)+'DADOS DOS EMPREENDIMENTOS'!#REF!,IF(BR59='DADOS DOS EMPREENDIMENTOS'!BT$12,'DADOS DOS EMPREENDIMENTOS'!#REF!,BT59*(1-'DADOS DOS EMPREENDIMENTOS'!#REF!-'DADOS DOS EMPREENDIMENTOS'!#REF!))))","v":{"$error":"#REF!"}},null,13,"2010-06-01",8.6299999962697868E-2,{"$f":"IF(BW59<'DADOS DOS EMPREENDIMENTOS'!BY$11,0,IF(BW59='DADOS DOS EMPREENDIMENTOS'!BY$11,SUM(BY$46:BY59)*(1-'DADOS DOS EMPREENDIMENTOS'!#REF!-'DADOS DOS EMPREENDIMENTOS'!#REF!)+'DADOS DOS EMPREENDIMENTOS'!#REF!,IF(BW59='DADOS DOS EMPREENDIMENTOS'!BY$12,'DADOS DOS EMPREENDIMENTOS'!#REF!,BY59*(1-'DADOS DOS EMPREENDIMENTOS'!#REF!-'DADOS DOS EMPREENDIMENTOS'!#REF!))))","v":{"$error":"#REF!"}},null,13,"2010-06-01",8.6299999962697868E-2,{"$f":"IF(CB59<'DADOS DOS EMPREENDIMENTOS'!CD$11,0,IF(CB59='DADOS DOS EMPREENDIMENTOS'!CD$11,SUM(CD$46:CD59)*(1-'DADOS DOS EMPREENDIMENTOS'!#REF!-'DADOS DOS EMPREENDIMENTOS'!#REF!)+'DADOS DOS EMPREENDIMENTOS'!#REF!,IF(CB59='DADOS DOS EMPREENDIMENTOS'!CD$12,'DADOS DOS EMPREENDIMENTOS'!#REF!,CD59*(1-'DADOS DOS EMPREENDIMENTOS'!#REF!-'DADOS DOS EMPREENDIMENTOS'!#REF!))))","v":{"$error":"#REF!"}}]
[null,null,null,null,null,null,null,null,null,null,null,null,null,null,14,null,null,null,null,14,null,null,null,null,14,null,null,null,null,14,"2010-07-01",9.7599999710741514E-2,{"$f":"IF(AD60<'DADOS DOS EMPREENDIMENTOS'!AF$11,0,IF(AD60='DADOS DOS EMPREENDIMENTOS'!AF$11,SUM(AF$46:AF60)*(1-'DADOS DOS EMPREENDIMENTOS'!#REF!-'DADOS DOS EMPREENDIMENTOS'!#REF!)+'DADOS DOS EMPREENDIMENTOS'!#REF!,IF(AD60='DADOS DOS EMPREENDIMENTOS'!#REF!,'DADOS DOS EMPREENDIMENTOS'!#REF!,AF60*(1-'DADOS DOS EMPREENDIMENTOS'!#REF!-'DADOS DOS EMPREENDIMENTOS'!#REF!))))","v":{"$error":"#REF!"}},null,14,"2010-07-01",9.7599999710741514E-2,{"$f":"IF(AI60<'DADOS DOS EMPREENDIMENTOS'!AK$11,0,IF(AI60='DADOS DOS EMPREENDIMENTOS'!AK$11,SUM(AK$46:AK60)*(1-'DADOS DOS EMPREENDIMENTOS'!#REF!-'DADOS DOS EMPREENDIMENTOS'!#REF!)+'DADOS DOS EMPREENDIMENTOS'!#REF!,IF(AI60='DADOS DOS EMPREENDIMENTOS'!#REF!,'DADOS DOS EMPREENDIMENTOS'!#REF!,AK60*(1-'DADOS DOS EMPREENDIMENTOS'!#REF!-'DADOS DOS EMPREENDIMENTOS'!#REF!))))","v":{"$error":"#REF!"}},null,14,"2010-07-01",9.7599999710741514E-2,{"$f":"IF(AN60<'DADOS DOS EMPREENDIMENTOS'!AP$11,0,IF(AN60='DADOS DOS EMPREENDIMENTOS'!AP$11,SUM(AP$46:AP60)*(1-'DADOS DOS EMPREENDIMENTOS'!#REF!-'DADOS DOS EMPREENDIMENTOS'!#REF!)+'DADOS DOS EMPREENDIMENTOS'!#REF!,IF(AN60='DADOS DOS EMPREENDIMENTOS'!#REF!,'DADOS DOS EMPREENDIMENTOS'!#REF!,AP60*(1-'DADOS DOS EMPREENDIMENTOS'!#REF!-'DADOS DOS EMPREENDIMENTOS'!#REF!))))","v":{"$error":"#REF!"}},null,14,"2010-07-01",9.7599999710741514E-2,{"$f":"IF(AS60<'DADOS DOS EMPREENDIMENTOS'!AU$11,0,IF(AS60='DADOS DOS EMPREENDIMENTOS'!AU$11,SUM(AU$46:AU60)*(1-'DADOS DOS EMPREENDIMENTOS'!#REF!-'DADOS DOS EMPREENDIMENTOS'!#REF!)+'DADOS DOS EMPREENDIMENTOS'!#REF!,IF(AS60='DADOS DOS EMPREENDIMENTOS'!#REF!,'DADOS DOS EMPREENDIMENTOS'!#REF!,AU60*(1-'DADOS DOS EMPREENDIMENTOS'!#REF!-'DADOS DOS EMPREENDIMENTOS'!#REF!))))","v":{"$error":"#REF!"}},null,14,"2010-07-01",9.7599999710741514E-2,{"$f":"IF(AX60<'DADOS DOS EMPREENDIMENTOS'!AZ$11,0,IF(AX60='DADOS DOS EMPREENDIMENTOS'!AZ$11,SUM(AZ$46:AZ60)*(1-'DADOS DOS EMPREENDIMENTOS'!#REF!-'DADOS DOS EMPREENDIMENTOS'!#REF!)+'DADOS DOS EMPREENDIMENTOS'!#REF!,IF(AX60='DADOS DOS EMPREENDIMENTOS'!#REF!,'DADOS DOS EMPREENDIMENTOS'!#REF!,AZ60*(1-'DADOS DOS EMPREENDIMENTOS'!#REF!-'DADOS DOS EMPREENDIMENTOS'!#REF!))))","v":{"$error":"#REF!"}},null,14,"2010-07-01",9.7599999710741514E-2,{"$f":"IF(BC60<'DADOS DOS EMPREENDIMENTOS'!BE$11,0,IF(BC60='DADOS DOS EMPREENDIMENTOS'!BE$11,SUM(BE$46:BE60)*(1-'DADOS DOS EMPREENDIMENTOS'!#REF!-'DADOS DOS EMPREENDIMENTOS'!#REF!)+'DADOS DOS EMPREENDIMENTOS'!#REF!,IF(BC60='DADOS DOS EMPREENDIMENTOS'!#REF!,'DADOS DOS EMPREENDIMENTOS'!#REF!,BE60*(1-'DADOS DOS EMPREENDIMENTOS'!#REF!-'DADOS DOS EMPREENDIMENTOS'!#REF!))))","v":{"$error":"#REF!"}},null,14,"2010-07-01",9.7599999710741514E-2,{"$f":"IF(BH60<'DADOS DOS EMPREENDIMENTOS'!BJ$11,0,IF(BH60='DADOS DOS EMPREENDIMENTOS'!BJ$11,SUM(BJ$46:BJ60)*(1-'DADOS DOS EMPREENDIMENTOS'!#REF!-'DADOS DOS EMPREENDIMENTOS'!#REF!)+'DADOS DOS EMPREENDIMENTOS'!#REF!,IF(BH60='DADOS DOS EMPREENDIMENTOS'!#REF!,'DADOS DOS EMPREENDIMENTOS'!#REF!,BJ60*(1-'DADOS DOS EMPREENDIMENTOS'!#REF!-'DADOS DOS EMPREENDIMENTOS'!#REF!))))","v":{"$error":"#REF!"}},null,14,"2010-07-01",9.7599999710741514E-2,{"$f":"IF(BM60<'DADOS DOS EMPREENDIMENTOS'!BO$11,0,IF(BM60='DADOS DOS EMPREENDIMENTOS'!BO$11,SUM(BO$46:BO60)*(1-'DADOS DOS EMPREENDIMENTOS'!#REF!-'DADOS DOS EMPREENDIMENTOS'!#REF!)+'DADOS DOS EMPREENDIMENTOS'!#REF!,IF(BM60='DADOS DOS EMPREENDIMENTOS'!BO$12,'DADOS DOS EMPREENDIMENTOS'!#REF!,BO60*(1-'DADOS DOS EMPREENDIMENTOS'!#REF!-'DADOS DOS EMPREENDIMENTOS'!#REF!))))","v":{"$error":"#REF!"}},null,14,"2010-07-01",9.7599999710741514E-2,{"$f":"IF(BR60<'DADOS DOS EMPREENDIMENTOS'!BT$11,0,IF(BR60='DADOS DOS EMPREENDIMENTOS'!BT$11,SUM(BT$46:BT60)*(1-'DADOS DOS EMPREENDIMENTOS'!#REF!-'DADOS DOS EMPREENDIMENTOS'!#REF!)+'DADOS DOS EMPREENDIMENTOS'!#REF!,IF(BR60='DADOS DOS EMPREENDIMENTOS'!BT$12,'DADOS DOS EMPREENDIMENTOS'!#REF!,BT60*(1-'DADOS DOS EMPREENDIMENTOS'!#REF!-'DADOS DOS EMPREENDIMENTOS'!#REF!))))","v":{"$error":"#REF!"}},null,14,"2010-07-01",9.7599999710741514E-2,{"$f":"IF(BW60<'DADOS DOS EMPREENDIMENTOS'!BY$11,0,IF(BW60='DADOS DOS EMPREENDIMENTOS'!BY$11,SUM(BY$46:BY60)*(1-'DADOS DOS EMPREENDIMENTOS'!#REF!-'DADOS DOS EMPREENDIMENTOS'!#REF!)+'DADOS DOS EMPREENDIMENTOS'!#REF!,IF(BW60='DADOS DOS EMPREENDIMENTOS'!BY$12,'DADOS DOS EMPREENDIMENTOS'!#REF!,BY60*(1-'DADOS DOS EMPREENDIMENTOS'!#REF!-'DADOS DOS EMPREENDIMENTOS'!#REF!))))","v":{"$error":"#REF!"}},null,14,"2010-07-01",9.7599999710741514E-2,{"$f":"IF(CB60<'DADOS DOS EMPREENDIMENTOS'!CD$11,0,IF(CB60='DADOS DOS EMPREENDIMENTOS'!CD$11,SUM(CD$46:CD60)*(1-'DADOS DOS EMPREENDIMENTOS'!#REF!-'DADOS DOS EMPREENDIMENTOS'!#REF!)+'DADOS DOS EMPREENDIMENTOS'!#REF!,IF(CB60='DADOS DOS EMPREENDIMENTOS'!CD$12,'DADOS DOS EMPREENDIMENTOS'!#REF!,CD60*(1-'DADOS DOS EMPREENDIMENTOS'!#REF!-'DADOS DOS EMPREENDIMENTOS'!#REF!))))","v":{"$error":"#REF!"}}]
[null,null,null,null,null,null,null,null,null,null,null,null,null,null,15,null,null,null,null,15,null,null,null,null,15,null,null,null,null,15,"2010-08-01",0.11039999975882406,{"$f":"IF(AD61<'DADOS DOS EMPREENDIMENTOS'!AF$11,0,IF(AD61='DADOS DOS EMPREENDIMENTOS'!AF$11,SUM(AF$46:AF61)*(1-'DADOS DOS EMPREENDIMENTOS'!#REF!-'DADOS DOS EMPREENDIMENTOS'!#REF!)+'DADOS DOS EMPREENDIMENTOS'!#REF!,IF(AD61='DADOS DOS EMPREENDIMENTOS'!#REF!,'DADOS DOS EMPREENDIMENTOS'!#REF!,AF61*(1-'DADOS DOS EMPREENDIMENTOS'!#REF!-'DADOS DOS EMPREENDIMENTOS'!#REF!))))","v":{"$error":"#REF!"}},null,15,"2010-08-01",0.11039999975882406,{"$f":"IF(AI61<'DADOS DOS EMPREENDIMENTOS'!AK$11,0,IF(AI61='DADOS DOS EMPREENDIMENTOS'!AK$11,SUM(AK$46:AK61)*(1-'DADOS DOS EMPREENDIMENTOS'!#REF!-'DADOS DOS EMPREENDIMENTOS'!#REF!)+'DADOS DOS EMPREENDIMENTOS'!#REF!,IF(AI61='DADOS DOS EMPREENDIMENTOS'!#REF!,'DADOS DOS EMPREENDIMENTOS'!#REF!,AK61*(1-'DADOS DOS EMPREENDIMENTOS'!#REF!-'DADOS DOS EMPREENDIMENTOS'!#REF!))))","v":{"$error":"#REF!"}},null,15,"2010-08-01",0.11039999975882406,{"$f":"IF(AN61<'DADOS DOS EMPREENDIMENTOS'!AP$11,0,IF(AN61='DADOS DOS EMPREENDIMENTOS'!AP$11,SUM(AP$46:AP61)*(1-'DADOS DOS EMPREENDIMENTOS'!#REF!-'DADOS DOS EMPREENDIMENTOS'!#REF!)+'DADOS DOS EMPREENDIMENTOS'!#REF!,IF(AN61='DADOS DOS EMPREENDIMENTOS'!#REF!,'DADOS DOS EMPREENDIMENTOS'!#REF!,AP61*(1-'DADOS DOS EMPREENDIMENTOS'!#REF!-'DADOS DOS EMPREENDIMENTOS'!#REF!))))","v":{"$error":"#REF!"}},null,15,"2010-08-01",0.11039999975882406,{"$f":"IF(AS61<'DADOS DOS EMPREENDIMENTOS'!AU$11,0,IF(AS61='DADOS DOS EMPREENDIMENTOS'!AU$11,SUM(AU$46:AU61)*(1-'DADOS DOS EMPREENDIMENTOS'!#REF!-'DADOS DOS EMPREENDIMENTOS'!#REF!)+'DADOS DOS EMPREENDIMENTOS'!#REF!,IF(AS61='DADOS DOS EMPREENDIMENTOS'!#REF!,'DADOS DOS EMPREENDIMENTOS'!#REF!,AU61*(1-'DADOS DOS EMPREENDIMENTOS'!#REF!-'DADOS DOS EMPREENDIMENTOS'!#REF!))))","v":{"$error":"#REF!"}},null,15,"2010-08-01",0.11039999975882406,{"$f":"IF(AX61<'DADOS DOS EMPREENDIMENTOS'!AZ$11,0,IF(AX61='DADOS DOS EMPREENDIMENTOS'!AZ$11,SUM(AZ$46:AZ61)*(1-'DADOS DOS EMPREENDIMENTOS'!#REF!-'DADOS DOS EMPREENDIMENTOS'!#REF!)+'DADOS DOS EMPREENDIMENTOS'!#REF!,IF(AX61='DADOS DOS EMPREENDIMENTOS'!#REF!,'DADOS DOS EMPREENDIMENTOS'!#REF!,AZ61*(1-'DADOS DOS EMPREENDIMENTOS'!#REF!-'DADOS DOS EMPREENDIMENTOS'!#REF!))))","v":{"$error":"#REF!"}},null,15,"2010-08-01",0.11039999975882406,{"$f":"IF(BC61<'DADOS DOS EMPREENDIMENTOS'!BE$11,0,IF(BC61='DADOS DOS EMPREENDIMENTOS'!BE$11,SUM(BE$46:BE61)*(1-'DADOS DOS EMPREENDIMENTOS'!#REF!-'DADOS DOS EMPREENDIMENTOS'!#REF!)+'DADOS DOS EMPREENDIMENTOS'!#REF!,IF(BC61='DADOS DOS EMPREENDIMENTOS'!#REF!,'DADOS DOS EMPREENDIMENTOS'!#REF!,BE61*(1-'DADOS DOS EMPREENDIMENTOS'!#REF!-'DADOS DOS EMPREENDIMENTOS'!#REF!))))","v":{"$error":"#REF!"}},null,15,"2010-08-01",0.11039999975882406,{"$f":"IF(BH61<'DADOS DOS EMPREENDIMENTOS'!BJ$11,0,IF(BH61='DADOS DOS EMPREENDIMENTOS'!BJ$11,SUM(BJ$46:BJ61)*(1-'DADOS DOS EMPREENDIMENTOS'!#REF!-'DADOS DOS EMPREENDIMENTOS'!#REF!)+'DADOS DOS EMPREENDIMENTOS'!#REF!,IF(BH61='DADOS DOS EMPREENDIMENTOS'!#REF!,'DADOS DOS EMPREENDIMENTOS'!#REF!,BJ61*(1-'DADOS DOS EMPREENDIMENTOS'!#REF!-'DADOS DOS EMPREENDIMENTOS'!#REF!))))","v":{"$error":"#REF!"}},null,15,"2010-08-01",0.11039999975882406,{"$f":"IF(BM61<'DADOS DOS EMPREENDIMENTOS'!BO$11,0,IF(BM61='DADOS DOS EMPREENDIMENTOS'!BO$11,SUM(BO$46:BO61)*(1-'DADOS DOS EMPREENDIMENTOS'!#REF!-'DADOS DOS EMPREENDIMENTOS'!#REF!)+'DADOS DOS EMPREENDIMENTOS'!#REF!,IF(BM61='DADOS DOS EMPREENDIMENTOS'!BO$12,'DADOS DOS EMPREENDIMENTOS'!#REF!,BO61*(1-'DADOS DOS EMPREENDIMENTOS'!#REF!-'DADOS DOS EMPREENDIMENTOS'!#REF!))))","v":{"$error":"#REF!"}},null,15,"2010-08-01",0.11039999975882406,{"$f":"IF(BR61<'DADOS DOS EMPREENDIMENTOS'!BT$11,0,IF(BR61='DADOS DOS EMPREENDIMENTOS'!BT$11,SUM(BT$46:BT61)*(1-'DADOS DOS EMPREENDIMENTOS'!#REF!-'DADOS DOS EMPREENDIMENTOS'!#REF!)+'DADOS DOS EMPREENDIMENTOS'!#REF!,IF(BR61='DADOS DOS EMPREENDIMENTOS'!BT$12,'DADOS DOS EMPREENDIMENTOS'!#REF!,BT61*(1-'DADOS DOS EMPREENDIMENTOS'!#REF!-'DADOS DOS EMPREENDIMENTOS'!#REF!))))","v":{"$error":"#REF!"}},null,15,"2010-08-01",0.11039999975882406,{"$f":"IF(BW61<'DADOS DOS EMPREENDIMENTOS'!BY$11,0,IF(BW61='DADOS DOS EMPREENDIMENTOS'!BY$11,SUM(BY$46:BY61)*(1-'DADOS DOS EMPREENDIMENTOS'!#REF!-'DADOS DOS EMPREENDIMENTOS'!#REF!)+'DADOS DOS EMPREENDIMENTOS'!#REF!,IF(BW61='DADOS DOS EMPREENDIMENTOS'!BY$12,'DADOS DOS EMPREENDIMENTOS'!#REF!,BY61*(1-'DADOS DOS EMPREENDIMENTOS'!#REF!-'DADOS DOS EMPREENDIMENTOS'!#REF!))))","v":{"$error":"#REF!"}},null,15,"2010-08-01",0.11039999975882406,{"$f":"IF(CB61<'DADOS DOS EMPREENDIMENTOS'!CD$11,0,IF(CB61='DADOS DOS EMPREENDIMENTOS'!CD$11,SUM(CD$46:CD61)*(1-'DADOS DOS EMPREENDIMENTOS'!#REF!-'DADOS DOS EMPREENDIMENTOS'!#REF!)+'DADOS DOS EMPREENDIMENTOS'!#REF!,IF(CB61='DADOS DOS EMPREENDIMENTOS'!CD$12,'DADOS DOS EMPREENDIMENTOS'!#REF!,CD61*(1-'DADOS DOS EMPREENDIMENTOS'!#REF!-'DADOS DOS EMPREENDIMENTOS'!#REF!))))","v":{"$error":"#REF!"}}]
[null,null,null,null,null,null,null,null,null,null,null,null,null,null,16,null,null,null,null,16,null,null,null,null,16,null,null,null,null,16,"2010-09-01",0.12510000012335462,{"$f":"IF(AD62<'DADOS DOS EMPREENDIMENTOS'!AF$11,0,IF(AD62='DADOS DOS EMPREENDIMENTOS'!AF$11,SUM(AF$46:AF62)*(1-'DADOS DOS EMPREENDIMENTOS'!#REF!-'DADOS DOS EMPREENDIMENTOS'!#REF!)+'DADOS DOS EMPREENDIMENTOS'!#REF!,IF(AD62='DADOS DOS EMPREENDIMENTOS'!#REF!,'DADOS DOS EMPREENDIMENTOS'!#REF!,AF62*(1-'DADOS DOS EMPREENDIMENTOS'!#REF!-'DADOS DOS EMPREENDIMENTOS'!#REF!))))","v":{"$error":"#REF!"}},null,16,"2010-09-01",0.12510000012335462,{"$f":"IF(AI62<'DADOS DOS EMPREENDIMENTOS'!AK$11,0,IF(AI62='DADOS DOS EMPREENDIMENTOS'!AK$11,SUM(AK$46:AK62)*(1-'DADOS DOS EMPREENDIMENTOS'!#REF!-'DADOS DOS EMPREENDIMENTOS'!#REF!)+'DADOS DOS EMPREENDIMENTOS'!#REF!,IF(AI62='DADOS DOS EMPREENDIMENTOS'!#REF!,'DADOS DOS EMPREENDIMENTOS'!#REF!,AK62*(1-'DADOS DOS EMPREENDIMENTOS'!#REF!-'DADOS DOS EMPREENDIMENTOS'!#REF!))))","v":{"$error":"#REF!"}},null,16,"2010-09-01",0.12510000012335462,{"$f":"IF(AN62<'DADOS DOS EMPREENDIMENTOS'!AP$11,0,IF(AN62='DADOS DOS EMPREENDIMENTOS'!AP$11,SUM(AP$46:AP62)*(1-'DADOS DOS EMPREENDIMENTOS'!#REF!-'DADOS DOS EMPREENDIMENTOS'!#REF!)+'DADOS DOS EMPREENDIMENTOS'!#REF!,IF(AN62='DADOS DOS EMPREENDIMENTOS'!#REF!,'DADOS DOS EMPREENDIMENTOS'!#REF!,AP62*(1-'DADOS DOS EMPREENDIMENTOS'!#REF!-'DADOS DOS EMPREENDIMENTOS'!#REF!))))","v":{"$error":"#REF!"}},null,16,"2010-09-01",0.12510000012335462,{"$f":"IF(AS62<'DADOS DOS EMPREENDIMENTOS'!AU$11,0,IF(AS62='DADOS DOS EMPREENDIMENTOS'!AU$11,SUM(AU$46:AU62)*(1-'DADOS DOS EMPREENDIMENTOS'!#REF!-'DADOS DOS EMPREENDIMENTOS'!#REF!)+'DADOS DOS EMPREENDIMENTOS'!#REF!,IF(AS62='DADOS DOS EMPREENDIMENTOS'!#REF!,'DADOS DOS EMPREENDIMENTOS'!#REF!,AU62*(1-'DADOS DOS EMPREENDIMENTOS'!#REF!-'DADOS DOS EMPREENDIMENTOS'!#REF!))))","v":{"$error":"#REF!"}},null,16,"2010-09-01",0.12510000012335462,{"$f":"IF(AX62<'DADOS DOS EMPREENDIMENTOS'!AZ$11,0,IF(AX62='DADOS DOS EMPREENDIMENTOS'!AZ$11,SUM(AZ$46:AZ62)*(1-'DADOS DOS EMPREENDIMENTOS'!#REF!-'DADOS DOS EMPREENDIMENTOS'!#REF!)+'DADOS DOS EMPREENDIMENTOS'!#REF!,IF(AX62='DADOS DOS EMPREENDIMENTOS'!#REF!,'DADOS DOS EMPREENDIMENTOS'!#REF!,AZ62*(1-'DADOS DOS EMPREENDIMENTOS'!#REF!-'DADOS DOS EMPREENDIMENTOS'!#REF!))))","v":{"$error":"#REF!"}},null,16,"2010-09-01",0.12510000012335462,{"$f":"IF(BC62<'DADOS DOS EMPREENDIMENTOS'!BE$11,0,IF(BC62='DADOS DOS EMPREENDIMENTOS'!BE$11,SUM(BE$46:BE62)*(1-'DADOS DOS EMPREENDIMENTOS'!#REF!-'DADOS DOS EMPREENDIMENTOS'!#REF!)+'DADOS DOS EMPREENDIMENTOS'!#REF!,IF(BC62='DADOS DOS EMPREENDIMENTOS'!#REF!,'DADOS DOS EMPREENDIMENTOS'!#REF!,BE62*(1-'DADOS DOS EMPREENDIMENTOS'!#REF!-'DADOS DOS EMPREENDIMENTOS'!#REF!))))","v":{"$error":"#REF!"}},null,16,"2010-09-01",0.12510000012335462,{"$f":"IF(BH62<'DADOS DOS EMPREENDIMENTOS'!BJ$11,0,IF(BH62='DADOS DOS EMPREENDIMENTOS'!BJ$11,SUM(BJ$46:BJ62)*(1-'DADOS DOS EMPREENDIMENTOS'!#REF!-'DADOS DOS EMPREENDIMENTOS'!#REF!)+'DADOS DOS EMPREENDIMENTOS'!#REF!,IF(BH62='DADOS DOS EMPREENDIMENTOS'!#REF!,'DADOS DOS EMPREENDIMENTOS'!#REF!,BJ62*(1-'DADOS DOS EMPREENDIMENTOS'!#REF!-'DADOS DOS EMPREENDIMENTOS'!#REF!))))","v":{"$error":"#REF!"}},null,16,"2010-09-01",0.12510000012335462,{"$f":"IF(BM62<'DADOS DOS EMPREENDIMENTOS'!BO$11,0,IF(BM62='DADOS DOS EMPREENDIMENTOS'!BO$11,SUM(BO$46:BO62)*(1-'DADOS DOS EMPREENDIMENTOS'!#REF!-'DADOS DOS EMPREENDIMENTOS'!#REF!)+'DADOS DOS EMPREENDIMENTOS'!#REF!,IF(BM62='DADOS DOS EMPREENDIMENTOS'!BO$12,'DADOS DOS EMPREENDIMENTOS'!#REF!,BO62*(1-'DADOS DOS EMPREENDIMENTOS'!#REF!-'DADOS DOS EMPREENDIMENTOS'!#REF!))))","v":{"$error":"#REF!"}},null,16,"2010-09-01",0.12510000012335462,{"$f":"IF(BR62<'DADOS DOS EMPREENDIMENTOS'!BT$11,0,IF(BR62='DADOS DOS EMPREENDIMENTOS'!BT$11,SUM(BT$46:BT62)*(1-'DADOS DOS EMPREENDIMENTOS'!#REF!-'DADOS DOS EMPREENDIMENTOS'!#REF!)+'DADOS DOS EMPREENDIMENTOS'!#REF!,IF(BR62='DADOS DOS EMPREENDIMENTOS'!BT$12,'DADOS DOS EMPREENDIMENTOS'!#REF!,BT62*(1-'DADOS DOS EMPREENDIMENTOS'!#REF!-'DADOS DOS EMPREENDIMENTOS'!#REF!))))","v":{"$error":"#REF!"}},null,16,"2010-09-01",0.12510000012335462,{"$f":"IF(BW62<'DADOS DOS EMPREENDIMENTOS'!BY$11,0,IF(BW62='DADOS DOS EMPREENDIMENTOS'!BY$11,SUM(BY$46:BY62)*(1-'DADOS DOS EMPREENDIMENTOS'!#REF!-'DADOS DOS EMPREENDIMENTOS'!#REF!)+'DADOS DOS EMPREENDIMENTOS'!#REF!,IF(BW62='DADOS DOS EMPREENDIMENTOS'!BY$12,'DADOS DOS EMPREENDIMENTOS'!#REF!,BY62*(1-'DADOS DOS EMPREENDIMENTOS'!#REF!-'DADOS DOS EMPREENDIMENTOS'!#REF!))))","v":{"$error":"#REF!"}},null,16,"2010-09-01",0.12510000012335462,{"$f":"IF(CB62<'DADOS DOS EMPREENDIMENTOS'!CD$11,0,IF(CB62='DADOS DOS EMPREENDIMENTOS'!CD$11,SUM(CD$46:CD62)*(1-'DADOS DOS EMPREENDIMENTOS'!#REF!-'DADOS DOS EMPREENDIMENTOS'!#REF!)+'DADOS DOS EMPREENDIMENTOS'!#REF!,IF(CB62='DADOS DOS EMPREENDIMENTOS'!CD$12,'DADOS DOS EMPREENDIMENTOS'!#REF!,CD62*(1-'DADOS DOS EMPREENDIMENTOS'!#REF!-'DADOS DOS EMPREENDIMENTOS'!#REF!))))","v":{"$error":"#REF!"}}]
[null,null,null,null,null,null,null,null,null,null,null,null,null,null,17,null,null,null,null,17,null,null,null,null,17,null,null,null,null,17,"2010-10-01",0.12929999981864104,{"$f":"IF(AD63<'DADOS DOS EMPREENDIMENTOS'!AF$11,0,IF(AD63='DADOS DOS EMPREENDIMENTOS'!AF$11,SUM(AF$46:AF63)*(1-'DADOS DOS EMPREENDIMENTOS'!#REF!-'DADOS DOS EMPREENDIMENTOS'!#REF!)+'DADOS DOS EMPREENDIMENTOS'!#REF!,IF(AD63='DADOS DOS EMPREENDIMENTOS'!#REF!,'DADOS DOS EMPREENDIMENTOS'!#REF!,AF63*(1-'DADOS DOS EMPREENDIMENTOS'!#REF!-'DADOS DOS EMPREENDIMENTOS'!#REF!))))","v":{"$error":"#REF!"}},null,17,"2010-10-01",0.12929999981864104,{"$f":"IF(AI63<'DADOS DOS EMPREENDIMENTOS'!AK$11,0,IF(AI63='DADOS DOS EMPREENDIMENTOS'!AK$11,SUM(AK$46:AK63)*(1-'DADOS DOS EMPREENDIMENTOS'!#REF!-'DADOS DOS EMPREENDIMENTOS'!#REF!)+'DADOS DOS EMPREENDIMENTOS'!#REF!,IF(AI63='DADOS DOS EMPREENDIMENTOS'!#REF!,'DADOS DOS EMPREENDIMENTOS'!#REF!,AK63*(1-'DADOS DOS EMPREENDIMENTOS'!#REF!-'DADOS DOS EMPREENDIMENTOS'!#REF!))))","v":{"$error":"#REF!"}},null,17,"2010-10-01",0.12929999981864104,{"$f":"IF(AN63<'DADOS DOS EMPREENDIMENTOS'!AP$11,0,IF(AN63='DADOS DOS EMPREENDIMENTOS'!AP$11,SUM(AP$46:AP63)*(1-'DADOS DOS EMPREENDIMENTOS'!#REF!-'DADOS DOS EMPREENDIMENTOS'!#REF!)+'DADOS DOS EMPREENDIMENTOS'!#REF!,IF(AN63='DADOS DOS EMPREENDIMENTOS'!#REF!,'DADOS DOS EMPREENDIMENTOS'!#REF!,AP63*(1-'DADOS DOS EMPREENDIMENTOS'!#REF!-'DADOS DOS EMPREENDIMENTOS'!#REF!))))","v":{"$error":"#REF!"}},null,17,"2010-10-01",0.12929999981864104,{"$f":"IF(AS63<'DADOS DOS EMPREENDIMENTOS'!AU$11,0,IF(AS63='DADOS DOS EMPREENDIMENTOS'!AU$11,SUM(AU$46:AU63)*(1-'DADOS DOS EMPREENDIMENTOS'!#REF!-'DADOS DOS EMPREENDIMENTOS'!#REF!)+'DADOS DOS EMPREENDIMENTOS'!#REF!,IF(AS63='DADOS DOS EMPREENDIMENTOS'!#REF!,'DADOS DOS EMPREENDIMENTOS'!#REF!,AU63*(1-'DADOS DOS EMPREENDIMENTOS'!#REF!-'DADOS DOS EMPREENDIMENTOS'!#REF!))))","v":{"$error":"#REF!"}},null,17,"2010-10-01",0.12929999981864104,{"$f":"IF(AX63<'DADOS DOS EMPREENDIMENTOS'!AZ$11,0,IF(AX63='DADOS DOS EMPREENDIMENTOS'!AZ$11,SUM(AZ$46:AZ63)*(1-'DADOS DOS EMPREENDIMENTOS'!#REF!-'DADOS DOS EMPREENDIMENTOS'!#REF!)+'DADOS DOS EMPREENDIMENTOS'!#REF!,IF(AX63='DADOS DOS EMPREENDIMENTOS'!#REF!,'DADOS DOS EMPREENDIMENTOS'!#REF!,AZ63*(1-'DADOS DOS EMPREENDIMENTOS'!#REF!-'DADOS DOS EMPREENDIMENTOS'!#REF!))))","v":{"$error":"#REF!"}},null,17,"2010-10-01",0.12929999981864104,{"$f":"IF(BC63<'DADOS DOS EMPREENDIMENTOS'!BE$11,0,IF(BC63='DADOS DOS EMPREENDIMENTOS'!BE$11,SUM(BE$46:BE63)*(1-'DADOS DOS EMPREENDIMENTOS'!#REF!-'DADOS DOS EMPREENDIMENTOS'!#REF!)+'DADOS DOS EMPREENDIMENTOS'!#REF!,IF(BC63='DADOS DOS EMPREENDIMENTOS'!#REF!,'DADOS DOS EMPREENDIMENTOS'!#REF!,BE63*(1-'DADOS DOS EMPREENDIMENTOS'!#REF!-'DADOS DOS EMPREENDIMENTOS'!#REF!))))","v":{"$error":"#REF!"}},null,17,"2010-10-01",0.12929999981864104,{"$f":"IF(BH63<'DADOS DOS EMPREENDIMENTOS'!BJ$11,0,IF(BH63='DADOS DOS EMPREENDIMENTOS'!BJ$11,SUM(BJ$46:BJ63)*(1-'DADOS DOS EMPREENDIMENTOS'!#REF!-'DADOS DOS EMPREENDIMENTOS'!#REF!)+'DADOS DOS EMPREENDIMENTOS'!#REF!,IF(BH63='DADOS DOS EMPREENDIMENTOS'!#REF!,'DADOS DOS EMPREENDIMENTOS'!#REF!,BJ63*(1-'DADOS DOS EMPREENDIMENTOS'!#REF!-'DADOS DOS EMPREENDIMENTOS'!#REF!))))","v":{"$error":"#REF!"}},null,17,"2010-10-01",0.12929999981864104,{"$f":"IF(BM63<'DADOS DOS EMPREENDIMENTOS'!BO$11,0,IF(BM63='DADOS DOS EMPREENDIMENTOS'!BO$11,SUM(BO$46:BO63)*(1-'DADOS DOS EMPREENDIMENTOS'!#REF!-'DADOS DOS EMPREENDIMENTOS'!#REF!)+'DADOS DOS EMPREENDIMENTOS'!#REF!,IF(BM63='DADOS DOS EMPREENDIMENTOS'!BO$12,'DADOS DOS EMPREENDIMENTOS'!#REF!,BO63*(1-'DADOS DOS EMPREENDIMENTOS'!#REF!-'DADOS DOS EMPREENDIMENTOS'!#REF!))))","v":{"$error":"#REF!"}},null,17,"2010-10-01",0.12929999981864104,{"$f":"IF(BR63<'DADOS DOS EMPREENDIMENTOS'!BT$11,0,IF(BR63='DADOS DOS EMPREENDIMENTOS'!BT$11,SUM(BT$46:BT63)*(1-'DADOS DOS EMPREENDIMENTOS'!#REF!-'DADOS DOS EMPREENDIMENTOS'!#REF!)+'DADOS DOS EMPREENDIMENTOS'!#REF!,IF(BR63='DADOS DOS EMPREENDIMENTOS'!BT$12,'DADOS DOS EMPREENDIMENTOS'!#REF!,BT63*(1-'DADOS DOS EMPREENDIMENTOS'!#REF!-'DADOS DOS EMPREENDIMENTOS'!#REF!))))","v":{"$error":"#REF!"}},null,17,"2010-10-01",0.12929999981864104,{"$f":"IF(BW63<'DADOS DOS EMPREENDIMENTOS'!BY$11,0,IF(BW63='DADOS DOS EMPREENDIMENTOS'!BY$11,SUM(BY$46:BY63)*(1-'DADOS DOS EMPREENDIMENTOS'!#REF!-'DADOS DOS EMPREENDIMENTOS'!#REF!)+'DADOS DOS EMPREENDIMENTOS'!#REF!,IF(BW63='DADOS DOS EMPREENDIMENTOS'!BY$12,'DADOS DOS EMPREENDIMENTOS'!#REF!,BY63*(1-'DADOS DOS EMPREENDIMENTOS'!#REF!-'DADOS DOS EMPREENDIMENTOS'!#REF!))))","v":{"$error":"#REF!"}},null,17,"2010-10-01",0.12929999981864104,{"$f":"IF(CB63<'DADOS DOS EMPREENDIMENTOS'!CD$11,0,IF(CB63='DADOS DOS EMPREENDIMENTOS'!CD$11,SUM(CD$46:CD63)*(1-'DADOS DOS EMPREENDIMENTOS'!#REF!-'DADOS DOS EMPREENDIMENTOS'!#REF!)+'DADOS DOS EMPREENDIMENTOS'!#REF!,IF(CB63='DADOS DOS EMPREENDIMENTOS'!CD$12,'DADOS DOS EMPREENDIMENTOS'!#REF!,CD63*(1-'DADOS DOS EMPREENDIMENTOS'!#REF!-'DADOS DOS EMPREENDIMENTOS'!#REF!))))","v":{"$error":"#REF!"}}]
[null,null,null,null,null,null,null,null,null,null,null,null,null,null,18,null,null,null,null,18,null,null,null,null,18,null,null,null,null,18,"2010-11-01",0.1043999999896966,{"$f":"IF(AD64<'DADOS DOS EMPREENDIMENTOS'!AF$11,0,IF(AD64='DADOS DOS EMPREENDIMENTOS'!AF$11,SUM(AF$46:AF64)*(1-'DADOS DOS EMPREENDIMENTOS'!#REF!-'DADOS DOS EMPREENDIMENTOS'!#REF!)+'DADOS DOS EMPREENDIMENTOS'!#REF!,IF(AD64='DADOS DOS EMPREENDIMENTOS'!#REF!,'DADOS DOS EMPREENDIMENTOS'!#REF!,AF64*(1-'DADOS DOS EMPREENDIMENTOS'!#REF!-'DADOS DOS EMPREENDIMENTOS'!#REF!))))","v":{"$error":"#REF!"}},null,18,"2010-11-01",0.1043999999896966,{"$f":"IF(AI64<'DADOS DOS EMPREENDIMENTOS'!AK$11,0,IF(AI64='DADOS DOS EMPREENDIMENTOS'!AK$11,SUM(AK$46:AK64)*(1-'DADOS DOS EMPREENDIMENTOS'!#REF!-'DADOS DOS EMPREENDIMENTOS'!#REF!)+'DADOS DOS EMPREENDIMENTOS'!#REF!,IF(AI64='DADOS DOS EMPREENDIMENTOS'!#REF!,'DADOS DOS EMPREENDIMENTOS'!#REF!,AK64*(1-'DADOS DOS EMPREENDIMENTOS'!#REF!-'DADOS DOS EMPREENDIMENTOS'!#REF!))))","v":{"$error":"#REF!"}},null,18,"2010-11-01",0.1043999999896966,{"$f":"IF(AN64<'DADOS DOS EMPREENDIMENTOS'!AP$11,0,IF(AN64='DADOS DOS EMPREENDIMENTOS'!AP$11,SUM(AP$46:AP64)*(1-'DADOS DOS EMPREENDIMENTOS'!#REF!-'DADOS DOS EMPREENDIMENTOS'!#REF!)+'DADOS DOS EMPREENDIMENTOS'!#REF!,IF(AN64='DADOS DOS EMPREENDIMENTOS'!#REF!,'DADOS DOS EMPREENDIMENTOS'!#REF!,AP64*(1-'DADOS DOS EMPREENDIMENTOS'!#REF!-'DADOS DOS EMPREENDIMENTOS'!#REF!))))","v":{"$error":"#REF!"}},null,18,"2010-11-01",0.1043999999896966,{"$f":"IF(AS64<'DADOS DOS EMPREENDIMENTOS'!AU$11,0,IF(AS64='DADOS DOS EMPREENDIMENTOS'!AU$11,SUM(AU$46:AU64)*(1-'DADOS DOS EMPREENDIMENTOS'!#REF!-'DADOS DOS EMPREENDIMENTOS'!#REF!)+'DADOS DOS EMPREENDIMENTOS'!#REF!,IF(AS64='DADOS DOS EMPREENDIMENTOS'!#REF!,'DADOS DOS EMPREENDIMENTOS'!#REF!,AU64*(1-'DADOS DOS EMPREENDIMENTOS'!#REF!-'DADOS DOS EMPREENDIMENTOS'!#REF!))))","v":{"$error":"#REF!"}},null,18,"2010-11-01",0.1043999999896966,{"$f":"IF(AX64<'DADOS DOS EMPREENDIMENTOS'!AZ$11,0,IF(AX64='DADOS DOS EMPREENDIMENTOS'!AZ$11,SUM(AZ$46:AZ64)*(1-'DADOS DOS EMPREENDIMENTOS'!#REF!-'DADOS DOS EMPREENDIMENTOS'!#REF!)+'DADOS DOS EMPREENDIMENTOS'!#REF!,IF(AX64='DADOS DOS EMPREENDIMENTOS'!#REF!,'DADOS DOS EMPREENDIMENTOS'!#REF!,AZ64*(1-'DADOS DOS EMPREENDIMENTOS'!#REF!-'DADOS DOS EMPREENDIMENTOS'!#REF!))))","v":{"$error":"#REF!"}},null,18,"2010-11-01",0.1043999999896966,{"$f":"IF(BC64<'DADOS DOS EMPREENDIMENTOS'!BE$11,0,IF(BC64='DADOS DOS EMPREENDIMENTOS'!BE$11,SUM(BE$46:BE64)*(1-'DADOS DOS EMPREENDIMENTOS'!#REF!-'DADOS DOS EMPREENDIMENTOS'!#REF!)+'DADOS DOS EMPREENDIMENTOS'!#REF!,IF(BC64='DADOS DOS EMPREENDIMENTOS'!#REF!,'DADOS DOS EMPREENDIMENTOS'!#REF!,BE64*(1-'DADOS DOS EMPREENDIMENTOS'!#REF!-'DADOS DOS EMPREENDIMENTOS'!#REF!))))","v":{"$error":"#REF!"}},null,18,"2010-11-01",0.1043999999896966,{"$f":"IF(BH64<'DADOS DOS EMPREENDIMENTOS'!BJ$11,0,IF(BH64='DADOS DOS EMPREENDIMENTOS'!BJ$11,SUM(BJ$46:BJ64)*(1-'DADOS DOS EMPREENDIMENTOS'!#REF!-'DADOS DOS EMPREENDIMENTOS'!#REF!)+'DADOS DOS EMPREENDIMENTOS'!#REF!,IF(BH64='DADOS DOS EMPREENDIMENTOS'!#REF!,'DADOS DOS EMPREENDIMENTOS'!#REF!,BJ64*(1-'DADOS DOS EMPREENDIMENTOS'!#REF!-'DADOS DOS EMPREENDIMENTOS'!#REF!))))","v":{"$error":"#REF!"}},null,18,"2010-11-01",0.1043999999896966,{"$f":"IF(BM64<'DADOS DOS EMPREENDIMENTOS'!BO$11,0,IF(BM64='DADOS DOS EMPREENDIMENTOS'!BO$11,SUM(BO$46:BO64)*(1-'DADOS DOS EMPREENDIMENTOS'!#REF!-'DADOS DOS EMPREENDIMENTOS'!#REF!)+'DADOS DOS EMPREENDIMENTOS'!#REF!,IF(BM64='DADOS DOS EMPREENDIMENTOS'!BO$12,'DADOS DOS EMPREENDIMENTOS'!#REF!,BO64*(1-'DADOS DOS EMPREENDIMENTOS'!#REF!-'DADOS DOS EMPREENDIMENTOS'!#REF!))))","v":{"$error":"#REF!"}},null,18,"2010-11-01",0.1043999999896966,{"$f":"IF(BR64<'DADOS DOS EMPREENDIMENTOS'!BT$11,0,IF(BR64='DADOS DOS EMPREENDIMENTOS'!BT$11,SUM(BT$46:BT64)*(1-'DADOS DOS EMPREENDIMENTOS'!#REF!-'DADOS DOS EMPREENDIMENTOS'!#REF!)+'DADOS DOS EMPREENDIMENTOS'!#REF!,IF(BR64='DADOS DOS EMPREENDIMENTOS'!BT$12,'DADOS DOS EMPREENDIMENTOS'!#REF!,BT64*(1-'DADOS DOS EMPREENDIMENTOS'!#REF!-'DADOS DOS EMPREENDIMENTOS'!#REF!))))","v":{"$error":"#REF!"}},null,18,"2010-11-01",0.1043999999896966,{"$f":"IF(BW64<'DADOS DOS EMPREENDIMENTOS'!BY$11,0,IF(BW64='DADOS DOS EMPREENDIMENTOS'!BY$11,SUM(BY$46:BY64)*(1-'DADOS DOS EMPREENDIMENTOS'!#REF!-'DADOS DOS EMPREENDIMENTOS'!#REF!)+'DADOS DOS EMPREENDIMENTOS'!#REF!,IF(BW64='DADOS DOS EMPREENDIMENTOS'!BY$12,'DADOS DOS EMPREENDIMENTOS'!#REF!,BY64*(1-'DADOS DOS EMPREENDIMENTOS'!#REF!-'DADOS DOS EMPREENDIMENTOS'!#REF!))))","v":{"$error":"#REF!"}},null,18,"2010-11-01",0.1043999999896966,{"$f":"IF(CB64<'DADOS DOS EMPREENDIMENTOS'!CD$11,0,IF(CB64='DADOS DOS EMPREENDIMENTOS'!CD$11,SUM(CD$46:CD64)*(1-'DADOS DOS EMPREENDIMENTOS'!#REF!-'DADOS DOS EMPREENDIMENTOS'!#REF!)+'DADOS DOS EMPREENDIMENTOS'!#REF!,IF(CB64='DADOS DOS EMPREENDIMENTOS'!CD$12,'DADOS DOS EMPREENDIMENTOS'!#REF!,CD64*(1-'DADOS DOS EMPREENDIMENTOS'!#REF!-'DADOS DOS EMPREENDIMENTOS'!#REF!))))","v":{"$error":"#REF!"}}]
[null,null,null,null,null,null,null,null,null,null,null,null,null,null,19,null,null,null,null,19,null,null,null,null,19,null,null,null,null,19,"2010-12-01",5.6100000154837237E-2,{"$f":"IF(AD65<'DADOS DOS EMPREENDIMENTOS'!AF$11,0,IF(AD65='DADOS DOS EMPREENDIMENTOS'!AF$11,SUM(AF$46:AF65)*(1-'DADOS DOS EMPREENDIMENTOS'!#REF!-'DADOS DOS EMPREENDIMENTOS'!#REF!)+'DADOS DOS EMPREENDIMENTOS'!#REF!,IF(AD65='DADOS DOS EMPREENDIMENTOS'!#REF!,'DADOS DOS EMPREENDIMENTOS'!#REF!,AF65*(1-'DADOS DOS EMPREENDIMENTOS'!#REF!-'DADOS DOS EMPREENDIMENTOS'!#REF!))))","v":{"$error":"#REF!"}},null,19,"2010-12-01",5.6100000154837237E-2,{"$f":"IF(AI65<'DADOS DOS EMPREENDIMENTOS'!AK$11,0,IF(AI65='DADOS DOS EMPREENDIMENTOS'!AK$11,SUM(AK$46:AK65)*(1-'DADOS DOS EMPREENDIMENTOS'!#REF!-'DADOS DOS EMPREENDIMENTOS'!#REF!)+'DADOS DOS EMPREENDIMENTOS'!#REF!,IF(AI65='DADOS DOS EMPREENDIMENTOS'!#REF!,'DADOS DOS EMPREENDIMENTOS'!#REF!,AK65*(1-'DADOS DOS EMPREENDIMENTOS'!#REF!-'DADOS DOS EMPREENDIMENTOS'!#REF!))))","v":{"$error":"#REF!"}},null,19,"2010-12-01",5.6100000154837237E-2,{"$f":"IF(AN65<'DADOS DOS EMPREENDIMENTOS'!AP$11,0,IF(AN65='DADOS DOS EMPREENDIMENTOS'!AP$11,SUM(AP$46:AP65)*(1-'DADOS DOS EMPREENDIMENTOS'!#REF!-'DADOS DOS EMPREENDIMENTOS'!#REF!)+'DADOS DOS EMPREENDIMENTOS'!#REF!,IF(AN65='DADOS DOS EMPREENDIMENTOS'!#REF!,'DADOS DOS EMPREENDIMENTOS'!#REF!,AP65*(1-'DADOS DOS EMPREENDIMENTOS'!#REF!-'DADOS DOS EMPREENDIMENTOS'!#REF!))))","v":{"$error":"#REF!"}},null,19,"2010-12-01",5.6100000154837237E-2,{"$f":"IF(AS65<'DADOS DOS EMPREENDIMENTOS'!AU$11,0,IF(AS65='DADOS DOS EMPREENDIMENTOS'!AU$11,SUM(AU$46:AU65)*(1-'DADOS DOS EMPREENDIMENTOS'!#REF!-'DADOS DOS EMPREENDIMENTOS'!#REF!)+'DADOS DOS EMPREENDIMENTOS'!#REF!,IF(AS65='DADOS DOS EMPREENDIMENTOS'!#REF!,'DADOS DOS EMPREENDIMENTOS'!#REF!,AU65*(1-'DADOS DOS EMPREENDIMENTOS'!#REF!-'DADOS DOS EMPREENDIMENTOS'!#REF!))))","v":{"$error":"#REF!"}},null,19,"2010-12-01",5.6100000154837237E-2,{"$f":"IF(AX65<'DADOS DOS EMPREENDIMENTOS'!AZ$11,0,IF(AX65='DADOS DOS EMPREENDIMENTOS'!AZ$11,SUM(AZ$46:AZ65)*(1-'DADOS DOS EMPREENDIMENTOS'!#REF!-'DADOS DOS EMPREENDIMENTOS'!#REF!)+'DADOS DOS EMPREENDIMENTOS'!#REF!,IF(AX65='DADOS DOS EMPREENDIMENTOS'!#REF!,'DADOS DOS EMPREENDIMENTOS'!#REF!,AZ65*(1-'DADOS DOS EMPREENDIMENTOS'!#REF!-'DADOS DOS EMPREENDIMENTOS'!#REF!))))","v":{"$error":"#REF!"}},null,19,"2010-12-01",5.6100000154837237E-2,{"$f":"IF(BC65<'DADOS DOS EMPREENDIMENTOS'!BE$11,0,IF(BC65='DADOS DOS EMPREENDIMENTOS'!BE$11,SUM(BE$46:BE65)*(1-'DADOS DOS EMPREENDIMENTOS'!#REF!-'DADOS DOS EMPREENDIMENTOS'!#REF!)+'DADOS DOS EMPREENDIMENTOS'!#REF!,IF(BC65='DADOS DOS EMPREENDIMENTOS'!#REF!,'DADOS DOS EMPREENDIMENTOS'!#REF!,BE65*(1-'DADOS DOS EMPREENDIMENTOS'!#REF!-'DADOS DOS EMPREENDIMENTOS'!#REF!))))","v":{"$error":"#REF!"}},null,19,"2010-12-01",5.6100000154837237E-2,{"$f":"IF(BH65<'DADOS DOS EMPREENDIMENTOS'!BJ$11,0,IF(BH65='DADOS DOS EMPREENDIMENTOS'!BJ$11,SUM(BJ$46:BJ65)*(1-'DADOS DOS EMPREENDIMENTOS'!#REF!-'DADOS DOS EMPREENDIMENTOS'!#REF!)+'DADOS DOS EMPREENDIMENTOS'!#REF!,IF(BH65='DADOS DOS EMPREENDIMENTOS'!#REF!,'DADOS DOS EMPREENDIMENTOS'!#REF!,BJ65*(1-'DADOS DOS EMPREENDIMENTOS'!#REF!-'DADOS DOS EMPREENDIMENTOS'!#REF!))))","v":{"$error":"#REF!"}},null,19,"2010-12-01",5.6100000154837237E-2,{"$f":"IF(BM65<'DADOS DOS EMPREENDIMENTOS'!BO$11,0,IF(BM65='DADOS DOS EMPREENDIMENTOS'!BO$11,SUM(BO$46:BO65)*(1-'DADOS DOS EMPREENDIMENTOS'!#REF!-'DADOS DOS EMPREENDIMENTOS'!#REF!)+'DADOS DOS EMPREENDIMENTOS'!#REF!,IF(BM65='DADOS DOS EMPREENDIMENTOS'!BO$12,'DADOS DOS EMPREENDIMENTOS'!#REF!,BO65*(1-'DADOS DOS EMPREENDIMENTOS'!#REF!-'DADOS DOS EMPREENDIMENTOS'!#REF!))))","v":{"$error":"#REF!"}},null,19,"2010-12-01",5.6100000154837237E-2,{"$f":"IF(BR65<'DADOS DOS EMPREENDIMENTOS'!BT$11,0,IF(BR65='DADOS DOS EMPREENDIMENTOS'!BT$11,SUM(BT$46:BT65)*(1-'DADOS DOS EMPREENDIMENTOS'!#REF!-'DADOS DOS EMPREENDIMENTOS'!#REF!)+'DADOS DOS EMPREENDIMENTOS'!#REF!,IF(BR65='DADOS DOS EMPREENDIMENTOS'!BT$12,'DADOS DOS EMPREENDIMENTOS'!#REF!,BT65*(1-'DADOS DOS EMPREENDIMENTOS'!#REF!-'DADOS DOS EMPREENDIMENTOS'!#REF!))))","v":{"$error":"#REF!"}},null,19,"2010-12-01",5.6100000154837237E-2,{"$f":"IF(BW65<'DADOS DOS EMPREENDIMENTOS'!BY$11,0,IF(BW65='DADOS DOS EMPREENDIMENTOS'!BY$11,SUM(BY$46:BY65)*(1-'DADOS DOS EMPREENDIMENTOS'!#REF!-'DADOS DOS EMPREENDIMENTOS'!#REF!)+'DADOS DOS EMPREENDIMENTOS'!#REF!,IF(BW65='DADOS DOS EMPREENDIMENTOS'!BY$12,'DADOS DOS EMPREENDIMENTOS'!#REF!,BY65*(1-'DADOS DOS EMPREENDIMENTOS'!#REF!-'DADOS DOS EMPREENDIMENTOS'!#REF!))))","v":{"$error":"#REF!"}},null,19,"2010-12-01",5.6100000154837237E-2,{"$f":"IF(CB65<'DADOS DOS EMPREENDIMENTOS'!CD$11,0,IF(CB65='DADOS DOS EMPREENDIMENTOS'!CD$11,SUM(CD$46:CD65)*(1-'DADOS DOS EMPREENDIMENTOS'!#REF!-'DADOS DOS EMPREENDIMENTOS'!#REF!)+'DADOS DOS EMPREENDIMENTOS'!#REF!,IF(CB65='DADOS DOS EMPREENDIMENTOS'!CD$12,'DADOS DOS EMPREENDIMENTOS'!#REF!,CD65*(1-'DADOS DOS EMPREENDIMENTOS'!#REF!-'DADOS DOS EMPREENDIMENTOS'!#REF!))))","v":{"$error":"#REF!"}}]
[null,null,null,null,null,null,null,null,null,null,null,null,null,null,20,null,null,null,null,20,null,null,null,null,20,null,null,null,null,20,"2011-01-01",8.9000001265982839E-3,{"$f":"IF(AD66<'DADOS DOS EMPREENDIMENTOS'!AF$11,0,IF(AD66='DADOS DOS EMPREENDIMENTOS'!AF$11,SUM(AF$46:AF66)*(1-'DADOS DOS EMPREENDIMENTOS'!#REF!-'DADOS DOS EMPREENDIMENTOS'!#REF!)+'DADOS DOS EMPREENDIMENTOS'!#REF!,IF(AD66='DADOS DOS EMPREENDIMENTOS'!#REF!,'DADOS DOS EMPREENDIMENTOS'!#REF!,AF66*(1-'DADOS DOS EMPREENDIMENTOS'!#REF!-'DADOS DOS EMPREENDIMENTOS'!#REF!))))","v":{"$error":"#REF!"}},null,20,"2011-01-01",8.9000001265982839E-3,{"$f":"IF(AI66<'DADOS DOS EMPREENDIMENTOS'!AK$11,0,IF(AI66='DADOS DOS EMPREENDIMENTOS'!AK$11,SUM(AK$46:AK66)*(1-'DADOS DOS EMPREENDIMENTOS'!#REF!-'DADOS DOS EMPREENDIMENTOS'!#REF!)+'DADOS DOS EMPREENDIMENTOS'!#REF!,IF(AI66='DADOS DOS EMPREENDIMENTOS'!#REF!,'DADOS DOS EMPREENDIMENTOS'!#REF!,AK66*(1-'DADOS DOS EMPREENDIMENTOS'!#REF!-'DADOS DOS EMPREENDIMENTOS'!#REF!))))","v":{"$error":"#REF!"}},null,20,"2011-01-01",8.9000001265982839E-3,{"$f":"IF(AN66<'DADOS DOS EMPREENDIMENTOS'!AP$11,0,IF(AN66='DADOS DOS EMPREENDIMENTOS'!AP$11,SUM(AP$46:AP66)*(1-'DADOS DOS EMPREENDIMENTOS'!#REF!-'DADOS DOS EMPREENDIMENTOS'!#REF!)+'DADOS DOS EMPREENDIMENTOS'!#REF!,IF(AN66='DADOS DOS EMPREENDIMENTOS'!#REF!,'DADOS DOS EMPREENDIMENTOS'!#REF!,AP66*(1-'DADOS DOS EMPREENDIMENTOS'!#REF!-'DADOS DOS EMPREENDIMENTOS'!#REF!))))","v":{"$error":"#REF!"}},null,20,"2011-01-01",8.9000001265982839E-3,{"$f":"IF(AS66<'DADOS DOS EMPREENDIMENTOS'!AU$11,0,IF(AS66='DADOS DOS EMPREENDIMENTOS'!AU$11,SUM(AU$46:AU66)*(1-'DADOS DOS EMPREENDIMENTOS'!#REF!-'DADOS DOS EMPREENDIMENTOS'!#REF!)+'DADOS DOS EMPREENDIMENTOS'!#REF!,IF(AS66='DADOS DOS EMPREENDIMENTOS'!#REF!,'DADOS DOS EMPREENDIMENTOS'!#REF!,AU66*(1-'DADOS DOS EMPREENDIMENTOS'!#REF!-'DADOS DOS EMPREENDIMENTOS'!#REF!))))","v":{"$error":"#REF!"}},null,20,"2011-01-01",8.9000001265982839E-3,{"$f":"IF(AX66<'DADOS DOS EMPREENDIMENTOS'!AZ$11,0,IF(AX66='DADOS DOS EMPREENDIMENTOS'!AZ$11,SUM(AZ$46:AZ66)*(1-'DADOS DOS EMPREENDIMENTOS'!#REF!-'DADOS DOS EMPREENDIMENTOS'!#REF!)+'DADOS DOS EMPREENDIMENTOS'!#REF!,IF(AX66='DADOS DOS EMPREENDIMENTOS'!#REF!,'DADOS DOS EMPREENDIMENTOS'!#REF!,AZ66*(1-'DADOS DOS EMPREENDIMENTOS'!#REF!-'DADOS DOS EMPREENDIMENTOS'!#REF!))))","v":{"$error":"#REF!"}},null,20,"2011-01-01",8.9000001265982839E-3,{"$f":"IF(BC66<'DADOS DOS EMPREENDIMENTOS'!BE$11,0,IF(BC66='DADOS DOS EMPREENDIMENTOS'!BE$11,SUM(BE$46:BE66)*(1-'DADOS DOS EMPREENDIMENTOS'!#REF!-'DADOS DOS EMPREENDIMENTOS'!#REF!)+'DADOS DOS EMPREENDIMENTOS'!#REF!,IF(BC66='DADOS DOS EMPREENDIMENTOS'!#REF!,'DADOS DOS EMPREENDIMENTOS'!#REF!,BE66*(1-'DADOS DOS EMPREENDIMENTOS'!#REF!-'DADOS DOS EMPREENDIMENTOS'!#REF!))))","v":{"$error":"#REF!"}},null,20,"2011-01-01",8.9000001265982839E-3,{"$f":"IF(BH66<'DADOS DOS EMPREENDIMENTOS'!BJ$11,0,IF(BH66='DADOS DOS EMPREENDIMENTOS'!BJ$11,SUM(BJ$46:BJ66)*(1-'DADOS DOS EMPREENDIMENTOS'!#REF!-'DADOS DOS EMPREENDIMENTOS'!#REF!)+'DADOS DOS EMPREENDIMENTOS'!#REF!,IF(BH66='DADOS DOS EMPREENDIMENTOS'!#REF!,'DADOS DOS EMPREENDIMENTOS'!#REF!,BJ66*(1-'DADOS DOS EMPREENDIMENTOS'!#REF!-'DADOS DOS EMPREENDIMENTOS'!#REF!))))","v":{"$error":"#REF!"}},null,20,"2011-01-01",8.9000001265982839E-3,{"$f":"IF(BM66<'DADOS DOS EMPREENDIMENTOS'!BO$11,0,IF(BM66='DADOS DOS EMPREENDIMENTOS'!BO$11,SUM(BO$46:BO66)*(1-'DADOS DOS EMPREENDIMENTOS'!#REF!-'DADOS DOS EMPREENDIMENTOS'!#REF!)+'DADOS DOS EMPREENDIMENTOS'!#REF!,IF(BM66='DADOS DOS EMPREENDIMENTOS'!BO$12,'DADOS DOS EMPREENDIMENTOS'!#REF!,BO66*(1-'DADOS DOS EMPREENDIMENTOS'!#REF!-'DADOS DOS EMPREENDIMENTOS'!#REF!))))","v":{"$error":"#REF!"}},null,20,"2011-01-01",8.9000001265982839E-3,{"$f":"IF(BR66<'DADOS DOS EMPREENDIMENTOS'!BT$11,0,IF(BR66='DADOS DOS EMPREENDIMENTOS'!BT$11,SUM(BT$46:BT66)*(1-'DADOS DOS EMPREENDIMENTOS'!#REF!-'DADOS DOS EMPREENDIMENTOS'!#REF!)+'DADOS DOS EMPREENDIMENTOS'!#REF!,IF(BR66='DADOS DOS EMPREENDIMENTOS'!BT$12,'DADOS DOS EMPREENDIMENTOS'!#REF!,BT66*(1-'DADOS DOS EMPREENDIMENTOS'!#REF!-'DADOS DOS EMPREENDIMENTOS'!#REF!))))","v":{"$error":"#REF!"}},null,20,"2011-01-01",8.9000001265982839E-3,{"$f":"IF(BW66<'DADOS DOS EMPREENDIMENTOS'!BY$11,0,IF(BW66='DADOS DOS EMPREENDIMENTOS'!BY$11,SUM(BY$46:BY66)*(1-'DADOS DOS EMPREENDIMENTOS'!#REF!-'DADOS DOS EMPREENDIMENTOS'!#REF!)+'DADOS DOS EMPREENDIMENTOS'!#REF!,IF(BW66='DADOS DOS EMPREENDIMENTOS'!BY$12,'DADOS DOS EMPREENDIMENTOS'!#REF!,BY66*(1-'DADOS DOS EMPREENDIMENTOS'!#REF!-'DADOS DOS EMPREENDIMENTOS'!#REF!))))","v":{"$error":"#REF!"}},null,20,"2011-01-01",8.9000001265982839E-3,{"$f":"IF(CB66<'DADOS DOS EMPREENDIMENTOS'!CD$11,0,IF(CB66='DADOS DOS EMPREENDIMENTOS'!CD$11,SUM(CD$46:CD66)*(1-'DADOS DOS EMPREENDIMENTOS'!#REF!-'DADOS DOS EMPREENDIMENTOS'!#REF!)+'DADOS DOS EMPREENDIMENTOS'!#REF!,IF(CB66='DADOS DOS EMPREENDIMENTOS'!CD$12,'DADOS DOS EMPREENDIMENTOS'!#REF!,CD66*(1-'DADOS DOS EMPREENDIMENTOS'!#REF!-'DADOS DOS EMPREENDIMENTOS'!#REF!))))","v":{"$error":"#REF!"}}]
[null,null,null,null,null,null,null,null,null,null,null,null,null,null,21,null,null,null,null,21,null,null,null,null,21,null,null,null,null,21,"2011-02-01",0,{"$f":"IF(AD67<'DADOS DOS EMPREENDIMENTOS'!AF$11,0,IF(AD67='DADOS DOS EMPREENDIMENTOS'!AF$11,SUM(AF$46:AF67)*(1-'DADOS DOS EMPREENDIMENTOS'!#REF!-'DADOS DOS EMPREENDIMENTOS'!#REF!)+'DADOS DOS EMPREENDIMENTOS'!#REF!,IF(AD67='DADOS DOS EMPREENDIMENTOS'!#REF!,'DADOS DOS EMPREENDIMENTOS'!#REF!,AF67*(1-'DADOS DOS EMPREENDIMENTOS'!#REF!-'DADOS DOS EMPREENDIMENTOS'!#REF!))))","v":{"$error":"#REF!"}},null,21,"2011-02-01",0,{"$f":"IF(AI67<'DADOS DOS EMPREENDIMENTOS'!AK$11,0,IF(AI67='DADOS DOS EMPREENDIMENTOS'!AK$11,SUM(AK$46:AK67)*(1-'DADOS DOS EMPREENDIMENTOS'!#REF!-'DADOS DOS EMPREENDIMENTOS'!#REF!)+'DADOS DOS EMPREENDIMENTOS'!#REF!,IF(AI67='DADOS DOS EMPREENDIMENTOS'!#REF!,'DADOS DOS EMPREENDIMENTOS'!#REF!,AK67*(1-'DADOS DOS EMPREENDIMENTOS'!#REF!-'DADOS DOS EMPREENDIMENTOS'!#REF!))))","v":{"$error":"#REF!"}},null,21,"2011-02-01",0,{"$f":"IF(AN67<'DADOS DOS EMPREENDIMENTOS'!AP$11,0,IF(AN67='DADOS DOS EMPREENDIMENTOS'!AP$11,SUM(AP$46:AP67)*(1-'DADOS DOS EMPREENDIMENTOS'!#REF!-'DADOS DOS EMPREENDIMENTOS'!#REF!)+'DADOS DOS EMPREENDIMENTOS'!#REF!,IF(AN67='DADOS DOS EMPREENDIMENTOS'!#REF!,'DADOS DOS EMPREENDIMENTOS'!#REF!,AP67*(1-'DADOS DOS EMPREENDIMENTOS'!#REF!-'DADOS DOS EMPREENDIMENTOS'!#REF!))))","v":{"$error":"#REF!"}},null,21,"2011-02-01",0,{"$f":"IF(AS67<'DADOS DOS EMPREENDIMENTOS'!AU$11,0,IF(AS67='DADOS DOS EMPREENDIMENTOS'!AU$11,SUM(AU$46:AU67)*(1-'DADOS DOS EMPREENDIMENTOS'!#REF!-'DADOS DOS EMPREENDIMENTOS'!#REF!)+'DADOS DOS EMPREENDIMENTOS'!#REF!,IF(AS67='DADOS DOS EMPREENDIMENTOS'!#REF!,'DADOS DOS EMPREENDIMENTOS'!#REF!,AU67*(1-'DADOS DOS EMPREENDIMENTOS'!#REF!-'DADOS DOS EMPREENDIMENTOS'!#REF!))))","v":{"$error":"#REF!"}},null,21,"2011-02-01",0,{"$f":"IF(AX67<'DADOS DOS EMPREENDIMENTOS'!AZ$11,0,IF(AX67='DADOS DOS EMPREENDIMENTOS'!AZ$11,SUM(AZ$46:AZ67)*(1-'DADOS DOS EMPREENDIMENTOS'!#REF!-'DADOS DOS EMPREENDIMENTOS'!#REF!)+'DADOS DOS EMPREENDIMENTOS'!#REF!,IF(AX67='DADOS DOS EMPREENDIMENTOS'!#REF!,'DADOS DOS EMPREENDIMENTOS'!#REF!,AZ67*(1-'DADOS DOS EMPREENDIMENTOS'!#REF!-'DADOS DOS EMPREENDIMENTOS'!#REF!))))","v":{"$error":"#REF!"}},null,21,"2011-02-01",0,{"$f":"IF(BC67<'DADOS DOS EMPREENDIMENTOS'!BE$11,0,IF(BC67='DADOS DOS EMPREENDIMENTOS'!BE$11,SUM(BE$46:BE67)*(1-'DADOS DOS EMPREENDIMENTOS'!#REF!-'DADOS DOS EMPREENDIMENTOS'!#REF!)+'DADOS DOS EMPREENDIMENTOS'!#REF!,IF(BC67='DADOS DOS EMPREENDIMENTOS'!#REF!,'DADOS DOS EMPREENDIMENTOS'!#REF!,BE67*(1-'DADOS DOS EMPREENDIMENTOS'!#REF!-'DADOS DOS EMPREENDIMENTOS'!#REF!))))","v":{"$error":"#REF!"}},null,21,"2011-02-01",0,{"$f":"IF(BH67<'DADOS DOS EMPREENDIMENTOS'!BJ$11,0,IF(BH67='DADOS DOS EMPREENDIMENTOS'!BJ$11,SUM(BJ$46:BJ67)*(1-'DADOS DOS EMPREENDIMENTOS'!#REF!-'DADOS DOS EMPREENDIMENTOS'!#REF!)+'DADOS DOS EMPREENDIMENTOS'!#REF!,IF(BH67='DADOS DOS EMPREENDIMENTOS'!#REF!,'DADOS DOS EMPREENDIMENTOS'!#REF!,BJ67*(1-'DADOS DOS EMPREENDIMENTOS'!#REF!-'DADOS DOS EMPREENDIMENTOS'!#REF!))))","v":{"$error":"#REF!"}},null,21,"2011-02-01",0,{"$f":"IF(BM67<'DADOS DOS EMPREENDIMENTOS'!BO$11,0,IF(BM67='DADOS DOS EMPREENDIMENTOS'!BO$11,SUM(BO$46:BO67)*(1-'DADOS DOS EMPREENDIMENTOS'!#REF!-'DADOS DOS EMPREENDIMENTOS'!#REF!)+'DADOS DOS EMPREENDIMENTOS'!#REF!,IF(BM67='DADOS DOS EMPREENDIMENTOS'!BO$12,'DADOS DOS EMPREENDIMENTOS'!#REF!,BO67*(1-'DADOS DOS EMPREENDIMENTOS'!#REF!-'DADOS DOS EMPREENDIMENTOS'!#REF!))))","v":{"$error":"#REF!"}},null,21,"2011-02-01",0,{"$f":"IF(BR67<'DADOS DOS EMPREENDIMENTOS'!BT$11,0,IF(BR67='DADOS DOS EMPREENDIMENTOS'!BT$11,SUM(BT$46:BT67)*(1-'DADOS DOS EMPREENDIMENTOS'!#REF!-'DADOS DOS EMPREENDIMENTOS'!#REF!)+'DADOS DOS EMPREENDIMENTOS'!#REF!,IF(BR67='DADOS DOS EMPREENDIMENTOS'!BT$12,'DADOS DOS EMPREENDIMENTOS'!#REF!,BT67*(1-'DADOS DOS EMPREENDIMENTOS'!#REF!-'DADOS DOS EMPREENDIMENTOS'!#REF!))))","v":{"$error":"#REF!"}},null,21,"2011-02-01",0,{"$f":"IF(BW67<'DADOS DOS EMPREENDIMENTOS'!BY$11,0,IF(BW67='DADOS DOS EMPREENDIMENTOS'!BY$11,SUM(BY$46:BY67)*(1-'DADOS DOS EMPREENDIMENTOS'!#REF!-'DADOS DOS EMPREENDIMENTOS'!#REF!)+'DADOS DOS EMPREENDIMENTOS'!#REF!,IF(BW67='DADOS DOS EMPREENDIMENTOS'!BY$12,'DADOS DOS EMPREENDIMENTOS'!#REF!,BY67*(1-'DADOS DOS EMPREENDIMENTOS'!#REF!-'DADOS DOS EMPREENDIMENTOS'!#REF!))))","v":{"$error":"#REF!"}},null,21,"2011-02-01",0,{"$f":"IF(CB67<'DADOS DOS EMPREENDIMENTOS'!CD$11,0,IF(CB67='DADOS DOS EMPREENDIMENTOS'!CD$11,SUM(CD$46:CD67)*(1-'DADOS DOS EMPREENDIMENTOS'!#REF!-'DADOS DOS EMPREENDIMENTOS'!#REF!)+'DADOS DOS EMPREENDIMENTOS'!#REF!,IF(CB67='DADOS DOS EMPREENDIMENTOS'!CD$12,'DADOS DOS EMPREENDIMENTOS'!#REF!,CD67*(1-'DADOS DOS EMPREENDIMENTOS'!#REF!-'DADOS DOS EMPREENDIMENTOS'!#REF!))))","v":{"$error":"#REF!"}}]
[null,null,null,null,null,null,null,null,null,null,null,null,null,null,22,null,null,null,null,22,null,null,null,null,22,null,null,null,null,22,"2011-03-01",0,{"$f":"IF(AD68<'DADOS DOS EMPREENDIMENTOS'!AF$11,0,IF(AD68='DADOS DOS EMPREENDIMENTOS'!AF$11,SUM(AF$46:AF68)*(1-'DADOS DOS EMPREENDIMENTOS'!#REF!-'DADOS DOS EMPREENDIMENTOS'!#REF!)+'DADOS DOS EMPREENDIMENTOS'!#REF!,IF(AD68='DADOS DOS EMPREENDIMENTOS'!#REF!,'DADOS DOS EMPREENDIMENTOS'!#REF!,AF68*(1-'DADOS DOS EMPREENDIMENTOS'!#REF!-'DADOS DOS EMPREENDIMENTOS'!#REF!))))","v":{"$error":"#REF!"}},null,22,"2011-03-01",0,{"$f":"IF(AI68<'DADOS DOS EMPREENDIMENTOS'!AK$11,0,IF(AI68='DADOS DOS EMPREENDIMENTOS'!AK$11,SUM(AK$46:AK68)*(1-'DADOS DOS EMPREENDIMENTOS'!#REF!-'DADOS DOS EMPREENDIMENTOS'!#REF!)+'DADOS DOS EMPREENDIMENTOS'!#REF!,IF(AI68='DADOS DOS EMPREENDIMENTOS'!#REF!,'DADOS DOS EMPREENDIMENTOS'!#REF!,AK68*(1-'DADOS DOS EMPREENDIMENTOS'!#REF!-'DADOS DOS EMPREENDIMENTOS'!#REF!))))","v":{"$error":"#REF!"}},null,22,"2011-03-01",0,{"$f":"IF(AN68<'DADOS DOS EMPREENDIMENTOS'!AP$11,0,IF(AN68='DADOS DOS EMPREENDIMENTOS'!AP$11,SUM(AP$46:AP68)*(1-'DADOS DOS EMPREENDIMENTOS'!#REF!-'DADOS DOS EMPREENDIMENTOS'!#REF!)+'DADOS DOS EMPREENDIMENTOS'!#REF!,IF(AN68='DADOS DOS EMPREENDIMENTOS'!#REF!,'DADOS DOS EMPREENDIMENTOS'!#REF!,AP68*(1-'DADOS DOS EMPREENDIMENTOS'!#REF!-'DADOS DOS EMPREENDIMENTOS'!#REF!))))","v":{"$error":"#REF!"}},null,22,"2011-03-01",0,{"$f":"IF(AS68<'DADOS DOS EMPREENDIMENTOS'!AU$11,0,IF(AS68='DADOS DOS EMPREENDIMENTOS'!AU$11,SUM(AU$46:AU68)*(1-'DADOS DOS EMPREENDIMENTOS'!#REF!-'DADOS DOS EMPREENDIMENTOS'!#REF!)+'DADOS DOS EMPREENDIMENTOS'!#REF!,IF(AS68='DADOS DOS EMPREENDIMENTOS'!#REF!,'DADOS DOS EMPREENDIMENTOS'!#REF!,AU68*(1-'DADOS DOS EMPREENDIMENTOS'!#REF!-'DADOS DOS EMPREENDIMENTOS'!#REF!))))","v":{"$error":"#REF!"}},null,22,"2011-03-01",0,{"$f":"IF(AX68<'DADOS DOS EMPREENDIMENTOS'!AZ$11,0,IF(AX68='DADOS DOS EMPREENDIMENTOS'!AZ$11,SUM(AZ$46:AZ68)*(1-'DADOS DOS EMPREENDIMENTOS'!#REF!-'DADOS DOS EMPREENDIMENTOS'!#REF!)+'DADOS DOS EMPREENDIMENTOS'!#REF!,IF(AX68='DADOS DOS EMPREENDIMENTOS'!#REF!,'DADOS DOS EMPREENDIMENTOS'!#REF!,AZ68*(1-'DADOS DOS EMPREENDIMENTOS'!#REF!-'DADOS DOS EMPREENDIMENTOS'!#REF!))))","v":{"$error":"#REF!"}},null,22,"2011-03-01",0,{"$f":"IF(BC68<'DADOS DOS EMPREENDIMENTOS'!BE$11,0,IF(BC68='DADOS DOS EMPREENDIMENTOS'!BE$11,SUM(BE$46:BE68)*(1-'DADOS DOS EMPREENDIMENTOS'!#REF!-'DADOS DOS EMPREENDIMENTOS'!#REF!)+'DADOS DOS EMPREENDIMENTOS'!#REF!,IF(BC68='DADOS DOS EMPREENDIMENTOS'!#REF!,'DADOS DOS EMPREENDIMENTOS'!#REF!,BE68*(1-'DADOS DOS EMPREENDIMENTOS'!#REF!-'DADOS DOS EMPREENDIMENTOS'!#REF!))))","v":{"$error":"#REF!"}},null,22,"2011-03-01",0,{"$f":"IF(BH68<'DADOS DOS EMPREENDIMENTOS'!BJ$11,0,IF(BH68='DADOS DOS EMPREENDIMENTOS'!BJ$11,SUM(BJ$46:BJ68)*(1-'DADOS DOS EMPREENDIMENTOS'!#REF!-'DADOS DOS EMPREENDIMENTOS'!#REF!)+'DADOS DOS EMPREENDIMENTOS'!#REF!,IF(BH68='DADOS DOS EMPREENDIMENTOS'!#REF!,'DADOS DOS EMPREENDIMENTOS'!#REF!,BJ68*(1-'DADOS DOS EMPREENDIMENTOS'!#REF!-'DADOS DOS EMPREENDIMENTOS'!#REF!))))","v":{"$error":"#REF!"}},null,22,"2011-03-01",0,{"$f":"IF(BM68<'DADOS DOS EMPREENDIMENTOS'!BO$11,0,IF(BM68='DADOS DOS EMPREENDIMENTOS'!BO$11,SUM(BO$46:BO68)*(1-'DADOS DOS EMPREENDIMENTOS'!#REF!-'DADOS DOS EMPREENDIMENTOS'!#REF!)+'DADOS DOS EMPREENDIMENTOS'!#REF!,IF(BM68='DADOS DOS EMPREENDIMENTOS'!BO$12,'DADOS DOS EMPREENDIMENTOS'!#REF!,BO68*(1-'DADOS DOS EMPREENDIMENTOS'!#REF!-'DADOS DOS EMPREENDIMENTOS'!#REF!))))","v":{"$error":"#REF!"}},null,22,"2011-03-01",0,{"$f":"IF(BR68<'DADOS DOS EMPREENDIMENTOS'!BT$11,0,IF(BR68='DADOS DOS EMPREENDIMENTOS'!BT$11,SUM(BT$46:BT68)*(1-'DADOS DOS EMPREENDIMENTOS'!#REF!-'DADOS DOS EMPREENDIMENTOS'!#REF!)+'DADOS DOS EMPREENDIMENTOS'!#REF!,IF(BR68='DADOS DOS EMPREENDIMENTOS'!BT$12,'DADOS DOS EMPREENDIMENTOS'!#REF!,BT68*(1-'DADOS DOS EMPREENDIMENTOS'!#REF!-'DADOS DOS EMPREENDIMENTOS'!#REF!))))","v":{"$error":"#REF!"}},null,22,"2011-03-01",0,{"$f":"IF(BW68<'DADOS DOS EMPREENDIMENTOS'!BY$11,0,IF(BW68='DADOS DOS EMPREENDIMENTOS'!BY$11,SUM(BY$46:BY68)*(1-'DADOS DOS EMPREENDIMENTOS'!#REF!-'DADOS DOS EMPREENDIMENTOS'!#REF!)+'DADOS DOS EMPREENDIMENTOS'!#REF!,IF(BW68='DADOS DOS EMPREENDIMENTOS'!BY$12,'DADOS DOS EMPREENDIMENTOS'!#REF!,BY68*(1-'DADOS DOS EMPREENDIMENTOS'!#REF!-'DADOS DOS EMPREENDIMENTOS'!#REF!))))","v":{"$error":"#REF!"}},null,22,"2011-03-01",0,{"$f":"IF(CB68<'DADOS DOS EMPREENDIMENTOS'!CD$11,0,IF(CB68='DADOS DOS EMPREENDIMENTOS'!CD$11,SUM(CD$46:CD68)*(1-'DADOS DOS EMPREENDIMENTOS'!#REF!-'DADOS DOS EMPREENDIMENTOS'!#REF!)+'DADOS DOS EMPREENDIMENTOS'!#REF!,IF(CB68='DADOS DOS EMPREENDIMENTOS'!CD$12,'DADOS DOS EMPREENDIMENTOS'!#REF!,CD68*(1-'DADOS DOS EMPREENDIMENTOS'!#REF!-'DADOS DOS EMPREENDIMENTOS'!#REF!))))","v":{"$error":"#REF!"}}]
[null,null,null,null,null,null,null,null,null,null,null,null,null,null,23,null,null,null,null,23,null,null,null,null,23,null,null,null,null,23,"2011-04-01",0,{"$f":"IF(AD69<'DADOS DOS EMPREENDIMENTOS'!AF$11,0,IF(AD69='DADOS DOS EMPREENDIMENTOS'!AF$11,SUM(AF$46:AF69)*(1-'DADOS DOS EMPREENDIMENTOS'!#REF!-'DADOS DOS EMPREENDIMENTOS'!#REF!)+'DADOS DOS EMPREENDIMENTOS'!#REF!,IF(AD69='DADOS DOS EMPREENDIMENTOS'!#REF!,'DADOS DOS EMPREENDIMENTOS'!#REF!,AF69*(1-'DADOS DOS EMPREENDIMENTOS'!#REF!-'DADOS DOS EMPREENDIMENTOS'!#REF!))))","v":{"$error":"#REF!"}},null,23,"2011-04-01",0,{"$f":"IF(AI69<'DADOS DOS EMPREENDIMENTOS'!AK$11,0,IF(AI69='DADOS DOS EMPREENDIMENTOS'!AK$11,SUM(AK$46:AK69)*(1-'DADOS DOS EMPREENDIMENTOS'!#REF!-'DADOS DOS EMPREENDIMENTOS'!#REF!)+'DADOS DOS EMPREENDIMENTOS'!#REF!,IF(AI69='DADOS DOS EMPREENDIMENTOS'!#REF!,'DADOS DOS EMPREENDIMENTOS'!#REF!,AK69*(1-'DADOS DOS EMPREENDIMENTOS'!#REF!-'DADOS DOS EMPREENDIMENTOS'!#REF!))))","v":{"$error":"#REF!"}},null,23,"2011-04-01",0,{"$f":"IF(AN69<'DADOS DOS EMPREENDIMENTOS'!AP$11,0,IF(AN69='DADOS DOS EMPREENDIMENTOS'!AP$11,SUM(AP$46:AP69)*(1-'DADOS DOS EMPREENDIMENTOS'!#REF!-'DADOS DOS EMPREENDIMENTOS'!#REF!)+'DADOS DOS EMPREENDIMENTOS'!#REF!,IF(AN69='DADOS DOS EMPREENDIMENTOS'!#REF!,'DADOS DOS EMPREENDIMENTOS'!#REF!,AP69*(1-'DADOS DOS EMPREENDIMENTOS'!#REF!-'DADOS DOS EMPREENDIMENTOS'!#REF!))))","v":{"$error":"#REF!"}},null,23,"2011-04-01",0,{"$f":"IF(AS69<'DADOS DOS EMPREENDIMENTOS'!AU$11,0,IF(AS69='DADOS DOS EMPREENDIMENTOS'!AU$11,SUM(AU$46:AU69)*(1-'DADOS DOS EMPREENDIMENTOS'!#REF!-'DADOS DOS EMPREENDIMENTOS'!#REF!)+'DADOS DOS EMPREENDIMENTOS'!#REF!,IF(AS69='DADOS DOS EMPREENDIMENTOS'!#REF!,'DADOS DOS EMPREENDIMENTOS'!#REF!,AU69*(1-'DADOS DOS EMPREENDIMENTOS'!#REF!-'DADOS DOS EMPREENDIMENTOS'!#REF!))))","v":{"$error":"#REF!"}},null,23,"2011-04-01",0,{"$f":"IF(AX69<'DADOS DOS EMPREENDIMENTOS'!AZ$11,0,IF(AX69='DADOS DOS EMPREENDIMENTOS'!AZ$11,SUM(AZ$46:AZ69)*(1-'DADOS DOS EMPREENDIMENTOS'!#REF!-'DADOS DOS EMPREENDIMENTOS'!#REF!)+'DADOS DOS EMPREENDIMENTOS'!#REF!,IF(AX69='DADOS DOS EMPREENDIMENTOS'!#REF!,'DADOS DOS EMPREENDIMENTOS'!#REF!,AZ69*(1-'DADOS DOS EMPREENDIMENTOS'!#REF!-'DADOS DOS EMPREENDIMENTOS'!#REF!))))","v":{"$error":"#REF!"}},null,23,"2011-04-01",0,{"$f":"IF(BC69<'DADOS DOS EMPREENDIMENTOS'!BE$11,0,IF(BC69='DADOS DOS EMPREENDIMENTOS'!BE$11,SUM(BE$46:BE69)*(1-'DADOS DOS EMPREENDIMENTOS'!#REF!-'DADOS DOS EMPREENDIMENTOS'!#REF!)+'DADOS DOS EMPREENDIMENTOS'!#REF!,IF(BC69='DADOS DOS EMPREENDIMENTOS'!#REF!,'DADOS DOS EMPREENDIMENTOS'!#REF!,BE69*(1-'DADOS DOS EMPREENDIMENTOS'!#REF!-'DADOS DOS EMPREENDIMENTOS'!#REF!))))","v":{"$error":"#REF!"}},null,23,"2011-04-01",0,{"$f":"IF(BH69<'DADOS DOS EMPREENDIMENTOS'!BJ$11,0,IF(BH69='DADOS DOS EMPREENDIMENTOS'!BJ$11,SUM(BJ$46:BJ69)*(1-'DADOS DOS EMPREENDIMENTOS'!#REF!-'DADOS DOS EMPREENDIMENTOS'!#REF!)+'DADOS DOS EMPREENDIMENTOS'!#REF!,IF(BH69='DADOS DOS EMPREENDIMENTOS'!#REF!,'DADOS DOS EMPREENDIMENTOS'!#REF!,BJ69*(1-'DADOS DOS EMPREENDIMENTOS'!#REF!-'DADOS DOS EMPREENDIMENTOS'!#REF!))))","v":{"$error":"#REF!"}},null,23,"2011-04-01",0,{"$f":"IF(BM69<'DADOS DOS EMPREENDIMENTOS'!BO$11,0,IF(BM69='DADOS DOS EMPREENDIMENTOS'!BO$11,SUM(BO$46:BO69)*(1-'DADOS DOS EMPREENDIMENTOS'!#REF!-'DADOS DOS EMPREENDIMENTOS'!#REF!)+'DADOS DOS EMPREENDIMENTOS'!#REF!,IF(BM69='DADOS DOS EMPREENDIMENTOS'!BO$12,'DADOS DOS EMPREENDIMENTOS'!#REF!,BO69*(1-'DADOS DOS EMPREENDIMENTOS'!#REF!-'DADOS DOS EMPREENDIMENTOS'!#REF!))))","v":{"$error":"#REF!"}},null,23,"2011-04-01",0,{"$f":"IF(BR69<'DADOS DOS EMPREENDIMENTOS'!BT$11,0,IF(BR69='DADOS DOS EMPREENDIMENTOS'!BT$11,SUM(BT$46:BT69)*(1-'DADOS DOS EMPREENDIMENTOS'!#REF!-'DADOS DOS EMPREENDIMENTOS'!#REF!)+'DADOS DOS EMPREENDIMENTOS'!#REF!,IF(BR69='DADOS DOS EMPREENDIMENTOS'!BT$12,'DADOS DOS EMPREENDIMENTOS'!#REF!,BT69*(1-'DADOS DOS EMPREENDIMENTOS'!#REF!-'DADOS DOS EMPREENDIMENTOS'!#REF!))))","v":{"$error":"#REF!"}},null,23,"2011-04-01",0,{"$f":"IF(BW69<'DADOS DOS EMPREENDIMENTOS'!BY$11,0,IF(BW69='DADOS DOS EMPREENDIMENTOS'!BY$11,SUM(BY$46:BY69)*(1-'DADOS DOS EMPREENDIMENTOS'!#REF!-'DADOS DOS EMPREENDIMENTOS'!#REF!)+'DADOS DOS EMPREENDIMENTOS'!#REF!,IF(BW69='DADOS DOS EMPREENDIMENTOS'!BY$12,'DADOS DOS EMPREENDIMENTOS'!#REF!,BY69*(1-'DADOS DOS EMPREENDIMENTOS'!#REF!-'DADOS DOS EMPREENDIMENTOS'!#REF!))))","v":{"$error":"#REF!"}},null,23,"2011-04-01",0,{"$f":"IF(CB69<'DADOS DOS EMPREENDIMENTOS'!CD$11,0,IF(CB69='DADOS DOS EMPREENDIMENTOS'!CD$11,SUM(CD$46:CD69)*(1-'DADOS DOS EMPREENDIMENTOS'!#REF!-'DADOS DOS EMPREENDIMENTOS'!#REF!)+'DADOS DOS EMPREENDIMENTOS'!#REF!,IF(CB69='DADOS DOS EMPREENDIMENTOS'!CD$12,'DADOS DOS EMPREENDIMENTOS'!#REF!,CD69*(1-'DADOS DOS EMPREENDIMENTOS'!#REF!-'DADOS DOS EMPREENDIMENTOS'!#REF!))))","v":{"$error":"#REF!"}}]
[null,null,null,null,null,null,null,null,null,null,null,null,null,null,24,null,null,null,null,24,null,null,null,null,24,null,null,null,null,24,"2011-05-01",0,{"$f":"IF(AD70<'DADOS DOS EMPREENDIMENTOS'!AF$11,0,IF(AD70='DADOS DOS EMPREENDIMENTOS'!AF$11,SUM(AF$46:AF70)*(1-'DADOS DOS EMPREENDIMENTOS'!#REF!-'DADOS DOS EMPREENDIMENTOS'!#REF!)+'DADOS DOS EMPREENDIMENTOS'!#REF!,IF(AD70='DADOS DOS EMPREENDIMENTOS'!#REF!,'DADOS DOS EMPREENDIMENTOS'!#REF!,AF70*(1-'DADOS DOS EMPREENDIMENTOS'!#REF!-'DADOS DOS EMPREENDIMENTOS'!#REF!))))","v":{"$error":"#REF!"}},null,24,"2011-05-01",0,{"$f":"IF(AI70<'DADOS DOS EMPREENDIMENTOS'!AK$11,0,IF(AI70='DADOS DOS EMPREENDIMENTOS'!AK$11,SUM(AK$46:AK70)*(1-'DADOS DOS EMPREENDIMENTOS'!#REF!-'DADOS DOS EMPREENDIMENTOS'!#REF!)+'DADOS DOS EMPREENDIMENTOS'!#REF!,IF(AI70='DADOS DOS EMPREENDIMENTOS'!#REF!,'DADOS DOS EMPREENDIMENTOS'!#REF!,AK70*(1-'DADOS DOS EMPREENDIMENTOS'!#REF!-'DADOS DOS EMPREENDIMENTOS'!#REF!))))","v":{"$error":"#REF!"}},null,24,"2011-05-01",0,{"$f":"IF(AN70<'DADOS DOS EMPREENDIMENTOS'!AP$11,0,IF(AN70='DADOS DOS EMPREENDIMENTOS'!AP$11,SUM(AP$46:AP70)*(1-'DADOS DOS EMPREENDIMENTOS'!#REF!-'DADOS DOS EMPREENDIMENTOS'!#REF!)+'DADOS DOS EMPREENDIMENTOS'!#REF!,IF(AN70='DADOS DOS EMPREENDIMENTOS'!#REF!,'DADOS DOS EMPREENDIMENTOS'!#REF!,AP70*(1-'DADOS DOS EMPREENDIMENTOS'!#REF!-'DADOS DOS EMPREENDIMENTOS'!#REF!))))","v":{"$error":"#REF!"}},null,24,"2011-05-01",0,{"$f":"IF(AS70<'DADOS DOS EMPREENDIMENTOS'!AU$11,0,IF(AS70='DADOS DOS EMPREENDIMENTOS'!AU$11,SUM(AU$46:AU70)*(1-'DADOS DOS EMPREENDIMENTOS'!#REF!-'DADOS DOS EMPREENDIMENTOS'!#REF!)+'DADOS DOS EMPREENDIMENTOS'!#REF!,IF(AS70='DADOS DOS EMPREENDIMENTOS'!#REF!,'DADOS DOS EMPREENDIMENTOS'!#REF!,AU70*(1-'DADOS DOS EMPREENDIMENTOS'!#REF!-'DADOS DOS EMPREENDIMENTOS'!#REF!))))","v":{"$error":"#REF!"}},null,24,"2011-05-01",0,{"$f":"IF(AX70<'DADOS DOS EMPREENDIMENTOS'!AZ$11,0,IF(AX70='DADOS DOS EMPREENDIMENTOS'!AZ$11,SUM(AZ$46:AZ70)*(1-'DADOS DOS EMPREENDIMENTOS'!#REF!-'DADOS DOS EMPREENDIMENTOS'!#REF!)+'DADOS DOS EMPREENDIMENTOS'!#REF!,IF(AX70='DADOS DOS EMPREENDIMENTOS'!#REF!,'DADOS DOS EMPREENDIMENTOS'!#REF!,AZ70*(1-'DADOS DOS EMPREENDIMENTOS'!#REF!-'DADOS DOS EMPREENDIMENTOS'!#REF!))))","v":{"$error":"#REF!"}},null,24,"2011-05-01",0,{"$f":"IF(BC70<'DADOS DOS EMPREENDIMENTOS'!BE$11,0,IF(BC70='DADOS DOS EMPREENDIMENTOS'!BE$11,SUM(BE$46:BE70)*(1-'DADOS DOS EMPREENDIMENTOS'!#REF!-'DADOS DOS EMPREENDIMENTOS'!#REF!)+'DADOS DOS EMPREENDIMENTOS'!#REF!,IF(BC70='DADOS DOS EMPREENDIMENTOS'!#REF!,'DADOS DOS EMPREENDIMENTOS'!#REF!,BE70*(1-'DADOS DOS EMPREENDIMENTOS'!#REF!-'DADOS DOS EMPREENDIMENTOS'!#REF!))))","v":{"$error":"#REF!"}},null,24,"2011-05-01",0,{"$f":"IF(BH70<'DADOS DOS EMPREENDIMENTOS'!BJ$11,0,IF(BH70='DADOS DOS EMPREENDIMENTOS'!BJ$11,SUM(BJ$46:BJ70)*(1-'DADOS DOS EMPREENDIMENTOS'!#REF!-'DADOS DOS EMPREENDIMENTOS'!#REF!)+'DADOS DOS EMPREENDIMENTOS'!#REF!,IF(BH70='DADOS DOS EMPREENDIMENTOS'!#REF!,'DADOS DOS EMPREENDIMENTOS'!#REF!,BJ70*(1-'DADOS DOS EMPREENDIMENTOS'!#REF!-'DADOS DOS EMPREENDIMENTOS'!#REF!))))","v":{"$error":"#REF!"}},null,24,"2011-05-01",0,{"$f":"IF(BM70<'DADOS DOS EMPREENDIMENTOS'!BO$11,0,IF(BM70='DADOS DOS EMPREENDIMENTOS'!BO$11,SUM(BO$46:BO70)*(1-'DADOS DOS EMPREENDIMENTOS'!#REF!-'DADOS DOS EMPREENDIMENTOS'!#REF!)+'DADOS DOS EMPREENDIMENTOS'!#REF!,IF(BM70='DADOS DOS EMPREENDIMENTOS'!BO$12,'DADOS DOS EMPREENDIMENTOS'!#REF!,BO70*(1-'DADOS DOS EMPREENDIMENTOS'!#REF!-'DADOS DOS EMPREENDIMENTOS'!#REF!))))","v":{"$error":"#REF!"}},null,24,"2011-05-01",0,{"$f":"IF(BR70<'DADOS DOS EMPREENDIMENTOS'!BT$11,0,IF(BR70='DADOS DOS EMPREENDIMENTOS'!BT$11,SUM(BT$46:BT70)*(1-'DADOS DOS EMPREENDIMENTOS'!#REF!-'DADOS DOS EMPREENDIMENTOS'!#REF!)+'DADOS DOS EMPREENDIMENTOS'!#REF!,IF(BR70='DADOS DOS EMPREENDIMENTOS'!BT$12,'DADOS DOS EMPREENDIMENTOS'!#REF!,BT70*(1-'DADOS DOS EMPREENDIMENTOS'!#REF!-'DADOS DOS EMPREENDIMENTOS'!#REF!))))","v":{"$error":"#REF!"}},null,24,"2011-05-01",0,{"$f":"IF(BW70<'DADOS DOS EMPREENDIMENTOS'!BY$11,0,IF(BW70='DADOS DOS EMPREENDIMENTOS'!BY$11,SUM(BY$46:BY70)*(1-'DADOS DOS EMPREENDIMENTOS'!#REF!-'DADOS DOS EMPREENDIMENTOS'!#REF!)+'DADOS DOS EMPREENDIMENTOS'!#REF!,IF(BW70='DADOS DOS EMPREENDIMENTOS'!BY$12,'DADOS DOS EMPREENDIMENTOS'!#REF!,BY70*(1-'DADOS DOS EMPREENDIMENTOS'!#REF!-'DADOS DOS EMPREENDIMENTOS'!#REF!))))","v":{"$error":"#REF!"}},null,24,"2011-05-01",0,{"$f":"IF(CB70<'DADOS DOS EMPREENDIMENTOS'!CD$11,0,IF(CB70='DADOS DOS EMPREENDIMENTOS'!CD$11,SUM(CD$46:CD70)*(1-'DADOS DOS EMPREENDIMENTOS'!#REF!-'DADOS DOS EMPREENDIMENTOS'!#REF!)+'DADOS DOS EMPREENDIMENTOS'!#REF!,IF(CB70='DADOS DOS EMPREENDIMENTOS'!CD$12,'DADOS DOS EMPREENDIMENTOS'!#REF!,CD70*(1-'DADOS DOS EMPREENDIMENTOS'!#REF!-'DADOS DOS EMPREENDIMENTOS'!#REF!))))","v":{"$error":"#REF!"}}]
[null,null,null,null,null,null,null,null,null,null,null,null,null,null,25,null,null,null,null,25,null,null,null,null,25,null,null,null,null,25,"2011-06-01",0,{"$f":"IF(AD71<'DADOS DOS EMPREENDIMENTOS'!AF$11,0,IF(AD71='DADOS DOS EMPREENDIMENTOS'!AF$11,SUM(AF$46:AF71)*(1-'DADOS DOS EMPREENDIMENTOS'!#REF!-'DADOS DOS EMPREENDIMENTOS'!#REF!)+'DADOS DOS EMPREENDIMENTOS'!#REF!,IF(AD71='DADOS DOS EMPREENDIMENTOS'!#REF!,'DADOS DOS EMPREENDIMENTOS'!#REF!,AF71*(1-'DADOS DOS EMPREENDIMENTOS'!#REF!-'DADOS DOS EMPREENDIMENTOS'!#REF!))))","v":{"$error":"#REF!"}},null,25,"2011-06-01",0,{"$f":"IF(AI71<'DADOS DOS EMPREENDIMENTOS'!AK$11,0,IF(AI71='DADOS DOS EMPREENDIMENTOS'!AK$11,SUM(AK$46:AK71)*(1-'DADOS DOS EMPREENDIMENTOS'!#REF!-'DADOS DOS EMPREENDIMENTOS'!#REF!)+'DADOS DOS EMPREENDIMENTOS'!#REF!,IF(AI71='DADOS DOS EMPREENDIMENTOS'!#REF!,'DADOS DOS EMPREENDIMENTOS'!#REF!,AK71*(1-'DADOS DOS EMPREENDIMENTOS'!#REF!-'DADOS DOS EMPREENDIMENTOS'!#REF!))))","v":{"$error":"#REF!"}},null,25,"2011-06-01",0,{"$f":"IF(AN71<'DADOS DOS EMPREENDIMENTOS'!AP$11,0,IF(AN71='DADOS DOS EMPREENDIMENTOS'!AP$11,SUM(AP$46:AP71)*(1-'DADOS DOS EMPREENDIMENTOS'!#REF!-'DADOS DOS EMPREENDIMENTOS'!#REF!)+'DADOS DOS EMPREENDIMENTOS'!#REF!,IF(AN71='DADOS DOS EMPREENDIMENTOS'!#REF!,'DADOS DOS EMPREENDIMENTOS'!#REF!,AP71*(1-'DADOS DOS EMPREENDIMENTOS'!#REF!-'DADOS DOS EMPREENDIMENTOS'!#REF!))))","v":{"$error":"#REF!"}},null,25,"2011-06-01",0,{"$f":"IF(AS71<'DADOS DOS EMPREENDIMENTOS'!AU$11,0,IF(AS71='DADOS DOS EMPREENDIMENTOS'!AU$11,SUM(AU$46:AU71)*(1-'DADOS DOS EMPREENDIMENTOS'!#REF!-'DADOS DOS EMPREENDIMENTOS'!#REF!)+'DADOS DOS EMPREENDIMENTOS'!#REF!,IF(AS71='DADOS DOS EMPREENDIMENTOS'!#REF!,'DADOS DOS EMPREENDIMENTOS'!#REF!,AU71*(1-'DADOS DOS EMPREENDIMENTOS'!#REF!-'DADOS DOS EMPREENDIMENTOS'!#REF!))))","v":{"$error":"#REF!"}},null,25,"2011-06-01",0,{"$f":"IF(AX71<'DADOS DOS EMPREENDIMENTOS'!AZ$11,0,IF(AX71='DADOS DOS EMPREENDIMENTOS'!AZ$11,SUM(AZ$46:AZ71)*(1-'DADOS DOS EMPREENDIMENTOS'!#REF!-'DADOS DOS EMPREENDIMENTOS'!#REF!)+'DADOS DOS EMPREENDIMENTOS'!#REF!,IF(AX71='DADOS DOS EMPREENDIMENTOS'!#REF!,'DADOS DOS EMPREENDIMENTOS'!#REF!,AZ71*(1-'DADOS DOS EMPREENDIMENTOS'!#REF!-'DADOS DOS EMPREENDIMENTOS'!#REF!))))","v":{"$error":"#REF!"}},null,25,"2011-06-01",0,{"$f":"IF(BC71<'DADOS DOS EMPREENDIMENTOS'!BE$11,0,IF(BC71='DADOS DOS EMPREENDIMENTOS'!BE$11,SUM(BE$46:BE71)*(1-'DADOS DOS EMPREENDIMENTOS'!#REF!-'DADOS DOS EMPREENDIMENTOS'!#REF!)+'DADOS DOS EMPREENDIMENTOS'!#REF!,IF(BC71='DADOS DOS EMPREENDIMENTOS'!#REF!,'DADOS DOS EMPREENDIMENTOS'!#REF!,BE71*(1-'DADOS DOS EMPREENDIMENTOS'!#REF!-'DADOS DOS EMPREENDIMENTOS'!#REF!))))","v":{"$error":"#REF!"}},null,25,"2011-06-01",0,{"$f":"IF(BH71<'DADOS DOS EMPREENDIMENTOS'!BJ$11,0,IF(BH71='DADOS DOS EMPREENDIMENTOS'!BJ$11,SUM(BJ$46:BJ71)*(1-'DADOS DOS EMPREENDIMENTOS'!#REF!-'DADOS DOS EMPREENDIMENTOS'!#REF!)+'DADOS DOS EMPREENDIMENTOS'!#REF!,IF(BH71='DADOS DOS EMPREENDIMENTOS'!#REF!,'DADOS DOS EMPREENDIMENTOS'!#REF!,BJ71*(1-'DADOS DOS EMPREENDIMENTOS'!#REF!-'DADOS DOS EMPREENDIMENTOS'!#REF!))))","v":{"$error":"#REF!"}},null,25,"2011-06-01",0,{"$f":"IF(BM71<'DADOS DOS EMPREENDIMENTOS'!BO$11,0,IF(BM71='DADOS DOS EMPREENDIMENTOS'!BO$11,SUM(BO$46:BO71)*(1-'DADOS DOS EMPREENDIMENTOS'!#REF!-'DADOS DOS EMPREENDIMENTOS'!#REF!)+'DADOS DOS EMPREENDIMENTOS'!#REF!,IF(BM71='DADOS DOS EMPREENDIMENTOS'!BO$12,'DADOS DOS EMPREENDIMENTOS'!#REF!,BO71*(1-'DADOS DOS EMPREENDIMENTOS'!#REF!-'DADOS DOS EMPREENDIMENTOS'!#REF!))))","v":{"$error":"#REF!"}},null,25,"2011-06-01",0,{"$f":"IF(BR71<'DADOS DOS EMPREENDIMENTOS'!BT$11,0,IF(BR71='DADOS DOS EMPREENDIMENTOS'!BT$11,SUM(BT$46:BT71)*(1-'DADOS DOS EMPREENDIMENTOS'!#REF!-'DADOS DOS EMPREENDIMENTOS'!#REF!)+'DADOS DOS EMPREENDIMENTOS'!#REF!,IF(BR71='DADOS DOS EMPREENDIMENTOS'!BT$12,'DADOS DOS EMPREENDIMENTOS'!#REF!,BT71*(1-'DADOS DOS EMPREENDIMENTOS'!#REF!-'DADOS DOS EMPREENDIMENTOS'!#REF!))))","v":{"$error":"#REF!"}},null,25,"2011-06-01",0,{"$f":"IF(BW71<'DADOS DOS EMPREENDIMENTOS'!BY$11,0,IF(BW71='DADOS DOS EMPREENDIMENTOS'!BY$11,SUM(BY$46:BY71)*(1-'DADOS DOS EMPREENDIMENTOS'!#REF!-'DADOS DOS EMPREENDIMENTOS'!#REF!)+'DADOS DOS EMPREENDIMENTOS'!#REF!,IF(BW71='DADOS DOS EMPREENDIMENTOS'!BY$12,'DADOS DOS EMPREENDIMENTOS'!#REF!,BY71*(1-'DADOS DOS EMPREENDIMENTOS'!#REF!-'DADOS DOS EMPREENDIMENTOS'!#REF!))))","v":{"$error":"#REF!"}},null,25,"2011-06-01",0,{"$f":"IF(CB71<'DADOS DOS EMPREENDIMENTOS'!CD$11,0,IF(CB71='DADOS DOS EMPREENDIMENTOS'!CD$11,SUM(CD$46:CD71)*(1-'DADOS DOS EMPREENDIMENTOS'!#REF!-'DADOS DOS EMPREENDIMENTOS'!#REF!)+'DADOS DOS EMPREENDIMENTOS'!#REF!,IF(CB71='DADOS DOS EMPREENDIMENTOS'!CD$12,'DADOS DOS EMPREENDIMENTOS'!#REF!,CD71*(1-'DADOS DOS EMPREENDIMENTOS'!#REF!-'DADOS DOS EMPREENDIMENTOS'!#REF!))))","v":{"$error":"#REF!"}}]
[null,null,null,null,null,null,null,null,null,null,null,null,null,null,26,null,null,null,null,26,null,null,null,null,26,null,null,null,null,26,"2011-07-01",0,{"$f":"IF(AD72<'DADOS DOS EMPREENDIMENTOS'!AF$11,0,IF(AD72='DADOS DOS EMPREENDIMENTOS'!AF$11,SUM(AF$46:AF72)*(1-'DADOS DOS EMPREENDIMENTOS'!#REF!-'DADOS DOS EMPREENDIMENTOS'!#REF!)+'DADOS DOS EMPREENDIMENTOS'!#REF!,IF(AD72='DADOS DOS EMPREENDIMENTOS'!#REF!,'DADOS DOS EMPREENDIMENTOS'!#REF!,AF72*(1-'DADOS DOS EMPREENDIMENTOS'!#REF!-'DADOS DOS EMPREENDIMENTOS'!#REF!))))","v":{"$error":"#REF!"}},null,26,"2011-07-01",0,{"$f":"IF(AI72<'DADOS DOS EMPREENDIMENTOS'!AK$11,0,IF(AI72='DADOS DOS EMPREENDIMENTOS'!AK$11,SUM(AK$46:AK72)*(1-'DADOS DOS EMPREENDIMENTOS'!#REF!-'DADOS DOS EMPREENDIMENTOS'!#REF!)+'DADOS DOS EMPREENDIMENTOS'!#REF!,IF(AI72='DADOS DOS EMPREENDIMENTOS'!#REF!,'DADOS DOS EMPREENDIMENTOS'!#REF!,AK72*(1-'DADOS DOS EMPREENDIMENTOS'!#REF!-'DADOS DOS EMPREENDIMENTOS'!#REF!))))","v":{"$error":"#REF!"}},null,26,"2011-07-01",0,{"$f":"IF(AN72<'DADOS DOS EMPREENDIMENTOS'!AP$11,0,IF(AN72='DADOS DOS EMPREENDIMENTOS'!AP$11,SUM(AP$46:AP72)*(1-'DADOS DOS EMPREENDIMENTOS'!#REF!-'DADOS DOS EMPREENDIMENTOS'!#REF!)+'DADOS DOS EMPREENDIMENTOS'!#REF!,IF(AN72='DADOS DOS EMPREENDIMENTOS'!#REF!,'DADOS DOS EMPREENDIMENTOS'!#REF!,AP72*(1-'DADOS DOS EMPREENDIMENTOS'!#REF!-'DADOS DOS EMPREENDIMENTOS'!#REF!))))","v":{"$error":"#REF!"}},null,26,"2011-07-01",0,{"$f":"IF(AS72<'DADOS DOS EMPREENDIMENTOS'!AU$11,0,IF(AS72='DADOS DOS EMPREENDIMENTOS'!AU$11,SUM(AU$46:AU72)*(1-'DADOS DOS EMPREENDIMENTOS'!#REF!-'DADOS DOS EMPREENDIMENTOS'!#REF!)+'DADOS DOS EMPREENDIMENTOS'!#REF!,IF(AS72='DADOS DOS EMPREENDIMENTOS'!#REF!,'DADOS DOS EMPREENDIMENTOS'!#REF!,AU72*(1-'DADOS DOS EMPREENDIMENTOS'!#REF!-'DADOS DOS EMPREENDIMENTOS'!#REF!))))","v":{"$error":"#REF!"}},null,26,"2011-07-01",0,{"$f":"IF(AX72<'DADOS DOS EMPREENDIMENTOS'!AZ$11,0,IF(AX72='DADOS DOS EMPREENDIMENTOS'!AZ$11,SUM(AZ$46:AZ72)*(1-'DADOS DOS EMPREENDIMENTOS'!#REF!-'DADOS DOS EMPREENDIMENTOS'!#REF!)+'DADOS DOS EMPREENDIMENTOS'!#REF!,IF(AX72='DADOS DOS EMPREENDIMENTOS'!#REF!,'DADOS DOS EMPREENDIMENTOS'!#REF!,AZ72*(1-'DADOS DOS EMPREENDIMENTOS'!#REF!-'DADOS DOS EMPREENDIMENTOS'!#REF!))))","v":{"$error":"#REF!"}},null,26,"2011-07-01",0,{"$f":"IF(BC72<'DADOS DOS EMPREENDIMENTOS'!BE$11,0,IF(BC72='DADOS DOS EMPREENDIMENTOS'!BE$11,SUM(BE$46:BE72)*(1-'DADOS DOS EMPREENDIMENTOS'!#REF!-'DADOS DOS EMPREENDIMENTOS'!#REF!)+'DADOS DOS EMPREENDIMENTOS'!#REF!,IF(BC72='DADOS DOS EMPREENDIMENTOS'!#REF!,'DADOS DOS EMPREENDIMENTOS'!#REF!,BE72*(1-'DADOS DOS EMPREENDIMENTOS'!#REF!-'DADOS DOS EMPREENDIMENTOS'!#REF!))))","v":{"$error":"#REF!"}},null,26,"2011-07-01",0,{"$f":"IF(BH72<'DADOS DOS EMPREENDIMENTOS'!BJ$11,0,IF(BH72='DADOS DOS EMPREENDIMENTOS'!BJ$11,SUM(BJ$46:BJ72)*(1-'DADOS DOS EMPREENDIMENTOS'!#REF!-'DADOS DOS EMPREENDIMENTOS'!#REF!)+'DADOS DOS EMPREENDIMENTOS'!#REF!,IF(BH72='DADOS DOS EMPREENDIMENTOS'!#REF!,'DADOS DOS EMPREENDIMENTOS'!#REF!,BJ72*(1-'DADOS DOS EMPREENDIMENTOS'!#REF!-'DADOS DOS EMPREENDIMENTOS'!#REF!))))","v":{"$error":"#REF!"}},null,26,"2011-07-01",0,{"$f":"IF(BM72<'DADOS DOS EMPREENDIMENTOS'!BO$11,0,IF(BM72='DADOS DOS EMPREENDIMENTOS'!BO$11,SUM(BO$46:BO72)*(1-'DADOS DOS EMPREENDIMENTOS'!#REF!-'DADOS DOS EMPREENDIMENTOS'!#REF!)+'DADOS DOS EMPREENDIMENTOS'!#REF!,IF(BM72='DADOS DOS EMPREENDIMENTOS'!BO$12,'DADOS DOS EMPREENDIMENTOS'!#REF!,BO72*(1-'DADOS DOS EMPREENDIMENTOS'!#REF!-'DADOS DOS EMPREENDIMENTOS'!#REF!))))","v":{"$error":"#REF!"}},null,26,"2011-07-01",0,{"$f":"IF(BR72<'DADOS DOS EMPREENDIMENTOS'!BT$11,0,IF(BR72='DADOS DOS EMPREENDIMENTOS'!BT$11,SUM(BT$46:BT72)*(1-'DADOS DOS EMPREENDIMENTOS'!#REF!-'DADOS DOS EMPREENDIMENTOS'!#REF!)+'DADOS DOS EMPREENDIMENTOS'!#REF!,IF(BR72='DADOS DOS EMPREENDIMENTOS'!BT$12,'DADOS DOS EMPREENDIMENTOS'!#REF!,BT72*(1-'DADOS DOS EMPREENDIMENTOS'!#REF!-'DADOS DOS EMPREENDIMENTOS'!#REF!))))","v":{"$error":"#REF!"}},null,26,"2011-07-01",0,{"$f":"IF(BW72<'DADOS DOS EMPREENDIMENTOS'!BY$11,0,IF(BW72='DADOS DOS EMPREENDIMENTOS'!BY$11,SUM(BY$46:BY72)*(1-'DADOS DOS EMPREENDIMENTOS'!#REF!-'DADOS DOS EMPREENDIMENTOS'!#REF!)+'DADOS DOS EMPREENDIMENTOS'!#REF!,IF(BW72='DADOS DOS EMPREENDIMENTOS'!BY$12,'DADOS DOS EMPREENDIMENTOS'!#REF!,BY72*(1-'DADOS DOS EMPREENDIMENTOS'!#REF!-'DADOS DOS EMPREENDIMENTOS'!#REF!))))","v":{"$error":"#REF!"}},null,26,"2011-07-01",0,{"$f":"IF(CB72<'DADOS DOS EMPREENDIMENTOS'!CD$11,0,IF(CB72='DADOS DOS EMPREENDIMENTOS'!CD$11,SUM(CD$46:CD72)*(1-'DADOS DOS EMPREENDIMENTOS'!#REF!-'DADOS DOS EMPREENDIMENTOS'!#REF!)+'DADOS DOS EMPREENDIMENTOS'!#REF!,IF(CB72='DADOS DOS EMPREENDIMENTOS'!CD$12,'DADOS DOS EMPREENDIMENTOS'!#REF!,CD72*(1-'DADOS DOS EMPREENDIMENTOS'!#REF!-'DADOS DOS EMPREENDIMENTOS'!#REF!))))","v":{"$error":"#REF!"}}]
[null,null,null,null,null,null,null,null,null,null,null,null,null,null,27,null,null,null,null,27,null,null,null,null,27,null,null,null,null,27,"2011-08-01",0,{"$f":"IF(AD73<'DADOS DOS EMPREENDIMENTOS'!AF$11,0,IF(AD73='DADOS DOS EMPREENDIMENTOS'!AF$11,SUM(AF$46:AF73)*(1-'DADOS DOS EMPREENDIMENTOS'!#REF!-'DADOS DOS EMPREENDIMENTOS'!#REF!)+'DADOS DOS EMPREENDIMENTOS'!#REF!,IF(AD73='DADOS DOS EMPREENDIMENTOS'!#REF!,'DADOS DOS EMPREENDIMENTOS'!#REF!,AF73*(1-'DADOS DOS EMPREENDIMENTOS'!#REF!-'DADOS DOS EMPREENDIMENTOS'!#REF!))))","v":{"$error":"#REF!"}},null,27,"2011-08-01",0,{"$f":"IF(AI73<'DADOS DOS EMPREENDIMENTOS'!AK$11,0,IF(AI73='DADOS DOS EMPREENDIMENTOS'!AK$11,SUM(AK$46:AK73)*(1-'DADOS DOS EMPREENDIMENTOS'!#REF!-'DADOS DOS EMPREENDIMENTOS'!#REF!)+'DADOS DOS EMPREENDIMENTOS'!#REF!,IF(AI73='DADOS DOS EMPREENDIMENTOS'!#REF!,'DADOS DOS EMPREENDIMENTOS'!#REF!,AK73*(1-'DADOS DOS EMPREENDIMENTOS'!#REF!-'DADOS DOS EMPREENDIMENTOS'!#REF!))))","v":{"$error":"#REF!"}},null,27,"2011-08-01",0,{"$f":"IF(AN73<'DADOS DOS EMPREENDIMENTOS'!AP$11,0,IF(AN73='DADOS DOS EMPREENDIMENTOS'!AP$11,SUM(AP$46:AP73)*(1-'DADOS DOS EMPREENDIMENTOS'!#REF!-'DADOS DOS EMPREENDIMENTOS'!#REF!)+'DADOS DOS EMPREENDIMENTOS'!#REF!,IF(AN73='DADOS DOS EMPREENDIMENTOS'!#REF!,'DADOS DOS EMPREENDIMENTOS'!#REF!,AP73*(1-'DADOS DOS EMPREENDIMENTOS'!#REF!-'DADOS DOS EMPREENDIMENTOS'!#REF!))))","v":{"$error":"#REF!"}},null,27,"2011-08-01",0,{"$f":"IF(AS73<'DADOS DOS EMPREENDIMENTOS'!AU$11,0,IF(AS73='DADOS DOS EMPREENDIMENTOS'!AU$11,SUM(AU$46:AU73)*(1-'DADOS DOS EMPREENDIMENTOS'!#REF!-'DADOS DOS EMPREENDIMENTOS'!#REF!)+'DADOS DOS EMPREENDIMENTOS'!#REF!,IF(AS73='DADOS DOS EMPREENDIMENTOS'!#REF!,'DADOS DOS EMPREENDIMENTOS'!#REF!,AU73*(1-'DADOS DOS EMPREENDIMENTOS'!#REF!-'DADOS DOS EMPREENDIMENTOS'!#REF!))))","v":{"$error":"#REF!"}},null,27,"2011-08-01",0,{"$f":"IF(AX73<'DADOS DOS EMPREENDIMENTOS'!AZ$11,0,IF(AX73='DADOS DOS EMPREENDIMENTOS'!AZ$11,SUM(AZ$46:AZ73)*(1-'DADOS DOS EMPREENDIMENTOS'!#REF!-'DADOS DOS EMPREENDIMENTOS'!#REF!)+'DADOS DOS EMPREENDIMENTOS'!#REF!,IF(AX73='DADOS DOS EMPREENDIMENTOS'!#REF!,'DADOS DOS EMPREENDIMENTOS'!#REF!,AZ73*(1-'DADOS DOS EMPREENDIMENTOS'!#REF!-'DADOS DOS EMPREENDIMENTOS'!#REF!))))","v":{"$error":"#REF!"}},null,27,"2011-08-01",0,{"$f":"IF(BC73<'DADOS DOS EMPREENDIMENTOS'!BE$11,0,IF(BC73='DADOS DOS EMPREENDIMENTOS'!BE$11,SUM(BE$46:BE73)*(1-'DADOS DOS EMPREENDIMENTOS'!#REF!-'DADOS DOS EMPREENDIMENTOS'!#REF!)+'DADOS DOS EMPREENDIMENTOS'!#REF!,IF(BC73='DADOS DOS EMPREENDIMENTOS'!#REF!,'DADOS DOS EMPREENDIMENTOS'!#REF!,BE73*(1-'DADOS DOS EMPREENDIMENTOS'!#REF!-'DADOS DOS EMPREENDIMENTOS'!#REF!))))","v":{"$error":"#REF!"}},null,27,"2011-08-01",0,{"$f":"IF(BH73<'DADOS DOS EMPREENDIMENTOS'!BJ$11,0,IF(BH73='DADOS DOS EMPREENDIMENTOS'!BJ$11,SUM(BJ$46:BJ73)*(1-'DADOS DOS EMPREENDIMENTOS'!#REF!-'DADOS DOS EMPREENDIMENTOS'!#REF!)+'DADOS DOS EMPREENDIMENTOS'!#REF!,IF(BH73='DADOS DOS EMPREENDIMENTOS'!#REF!,'DADOS DOS EMPREENDIMENTOS'!#REF!,BJ73*(1-'DADOS DOS EMPREENDIMENTOS'!#REF!-'DADOS DOS EMPREENDIMENTOS'!#REF!))))","v":{"$error":"#REF!"}},null,27,"2011-08-01",0,{"$f":"IF(BM73<'DADOS DOS EMPREENDIMENTOS'!BO$11,0,IF(BM73='DADOS DOS EMPREENDIMENTOS'!BO$11,SUM(BO$46:BO73)*(1-'DADOS DOS EMPREENDIMENTOS'!#REF!-'DADOS DOS EMPREENDIMENTOS'!#REF!)+'DADOS DOS EMPREENDIMENTOS'!#REF!,IF(BM73='DADOS DOS EMPREENDIMENTOS'!BO$12,'DADOS DOS EMPREENDIMENTOS'!#REF!,BO73*(1-'DADOS DOS EMPREENDIMENTOS'!#REF!-'DADOS DOS EMPREENDIMENTOS'!#REF!))))","v":{"$error":"#REF!"}},null,27,"2011-08-01",0,{"$f":"IF(BR73<'DADOS DOS EMPREENDIMENTOS'!BT$11,0,IF(BR73='DADOS DOS EMPREENDIMENTOS'!BT$11,SUM(BT$46:BT73)*(1-'DADOS DOS EMPREENDIMENTOS'!#REF!-'DADOS DOS EMPREENDIMENTOS'!#REF!)+'DADOS DOS EMPREENDIMENTOS'!#REF!,IF(BR73='DADOS DOS EMPREENDIMENTOS'!BT$12,'DADOS DOS EMPREENDIMENTOS'!#REF!,BT73*(1-'DADOS DOS EMPREENDIMENTOS'!#REF!-'DADOS DOS EMPREENDIMENTOS'!#REF!))))","v":{"$error":"#REF!"}},null,27,"2011-08-01",0,{"$f":"IF(BW73<'DADOS DOS EMPREENDIMENTOS'!BY$11,0,IF(BW73='DADOS DOS EMPREENDIMENTOS'!BY$11,SUM(BY$46:BY73)*(1-'DADOS DOS EMPREENDIMENTOS'!#REF!-'DADOS DOS EMPREENDIMENTOS'!#REF!)+'DADOS DOS EMPREENDIMENTOS'!#REF!,IF(BW73='DADOS DOS EMPREENDIMENTOS'!BY$12,'DADOS DOS EMPREENDIMENTOS'!#REF!,BY73*(1-'DADOS DOS EMPREENDIMENTOS'!#REF!-'DADOS DOS EMPREENDIMENTOS'!#REF!))))","v":{"$error":"#REF!"}},null,27,"2011-08-01",0,{"$f":"IF(CB73<'DADOS DOS EMPREENDIMENTOS'!CD$11,0,IF(CB73='DADOS DOS EMPREENDIMENTOS'!CD$11,SUM(CD$46:CD73)*(1-'DADOS DOS EMPREENDIMENTOS'!#REF!-'DADOS DOS EMPREENDIMENTOS'!#REF!)+'DADOS DOS EMPREENDIMENTOS'!#REF!,IF(CB73='DADOS DOS EMPREENDIMENTOS'!CD$12,'DADOS DOS EMPREENDIMENTOS'!#REF!,CD73*(1-'DADOS DOS EMPREENDIMENTOS'!#REF!-'DADOS DOS EMPREENDIMENTOS'!#REF!))))","v":{"$error":"#REF!"}}]
[null,null,null,null,null,null,null,null,null,null,null,null,null,null,28,null,null,null,null,28,null,null,null,null,28,null,null,null,null,28,"2011-09-01",0,{"$f":"IF(AD74<'DADOS DOS EMPREENDIMENTOS'!AF$11,0,IF(AD74='DADOS DOS EMPREENDIMENTOS'!AF$11,SUM(AF$46:AF74)*(1-'DADOS DOS EMPREENDIMENTOS'!#REF!-'DADOS DOS EMPREENDIMENTOS'!#REF!)+'DADOS DOS EMPREENDIMENTOS'!#REF!,IF(AD74='DADOS DOS EMPREENDIMENTOS'!#REF!,'DADOS DOS EMPREENDIMENTOS'!#REF!,AF74*(1-'DADOS DOS EMPREENDIMENTOS'!#REF!-'DADOS DOS EMPREENDIMENTOS'!#REF!))))","v":{"$error":"#REF!"}},null,28,"2011-09-01",0,{"$f":"IF(AI74<'DADOS DOS EMPREENDIMENTOS'!AK$11,0,IF(AI74='DADOS DOS EMPREENDIMENTOS'!AK$11,SUM(AK$46:AK74)*(1-'DADOS DOS EMPREENDIMENTOS'!#REF!-'DADOS DOS EMPREENDIMENTOS'!#REF!)+'DADOS DOS EMPREENDIMENTOS'!#REF!,IF(AI74='DADOS DOS EMPREENDIMENTOS'!#REF!,'DADOS DOS EMPREENDIMENTOS'!#REF!,AK74*(1-'DADOS DOS EMPREENDIMENTOS'!#REF!-'DADOS DOS EMPREENDIMENTOS'!#REF!))))","v":{"$error":"#REF!"}},null,28,"2011-09-01",0,{"$f":"IF(AN74<'DADOS DOS EMPREENDIMENTOS'!AP$11,0,IF(AN74='DADOS DOS EMPREENDIMENTOS'!AP$11,SUM(AP$46:AP74)*(1-'DADOS DOS EMPREENDIMENTOS'!#REF!-'DADOS DOS EMPREENDIMENTOS'!#REF!)+'DADOS DOS EMPREENDIMENTOS'!#REF!,IF(AN74='DADOS DOS EMPREENDIMENTOS'!#REF!,'DADOS DOS EMPREENDIMENTOS'!#REF!,AP74*(1-'DADOS DOS EMPREENDIMENTOS'!#REF!-'DADOS DOS EMPREENDIMENTOS'!#REF!))))","v":{"$error":"#REF!"}},null,28,"2011-09-01",0,{"$f":"IF(AS74<'DADOS DOS EMPREENDIMENTOS'!AU$11,0,IF(AS74='DADOS DOS EMPREENDIMENTOS'!AU$11,SUM(AU$46:AU74)*(1-'DADOS DOS EMPREENDIMENTOS'!#REF!-'DADOS DOS EMPREENDIMENTOS'!#REF!)+'DADOS DOS EMPREENDIMENTOS'!#REF!,IF(AS74='DADOS DOS EMPREENDIMENTOS'!#REF!,'DADOS DOS EMPREENDIMENTOS'!#REF!,AU74*(1-'DADOS DOS EMPREENDIMENTOS'!#REF!-'DADOS DOS EMPREENDIMENTOS'!#REF!))))","v":{"$error":"#REF!"}},null,28,"2011-09-01",0,{"$f":"IF(AX74<'DADOS DOS EMPREENDIMENTOS'!AZ$11,0,IF(AX74='DADOS DOS EMPREENDIMENTOS'!AZ$11,SUM(AZ$46:AZ74)*(1-'DADOS DOS EMPREENDIMENTOS'!#REF!-'DADOS DOS EMPREENDIMENTOS'!#REF!)+'DADOS DOS EMPREENDIMENTOS'!#REF!,IF(AX74='DADOS DOS EMPREENDIMENTOS'!#REF!,'DADOS DOS EMPREENDIMENTOS'!#REF!,AZ74*(1-'DADOS DOS EMPREENDIMENTOS'!#REF!-'DADOS DOS EMPREENDIMENTOS'!#REF!))))","v":{"$error":"#REF!"}},null,28,"2011-09-01",0,{"$f":"IF(BC74<'DADOS DOS EMPREENDIMENTOS'!BE$11,0,IF(BC74='DADOS DOS EMPREENDIMENTOS'!BE$11,SUM(BE$46:BE74)*(1-'DADOS DOS EMPREENDIMENTOS'!#REF!-'DADOS DOS EMPREENDIMENTOS'!#REF!)+'DADOS DOS EMPREENDIMENTOS'!#REF!,IF(BC74='DADOS DOS EMPREENDIMENTOS'!#REF!,'DADOS DOS EMPREENDIMENTOS'!#REF!,BE74*(1-'DADOS DOS EMPREENDIMENTOS'!#REF!-'DADOS DOS EMPREENDIMENTOS'!#REF!))))","v":{"$error":"#REF!"}},null,28,"2011-09-01",0,{"$f":"IF(BH74<'DADOS DOS EMPREENDIMENTOS'!BJ$11,0,IF(BH74='DADOS DOS EMPREENDIMENTOS'!BJ$11,SUM(BJ$46:BJ74)*(1-'DADOS DOS EMPREENDIMENTOS'!#REF!-'DADOS DOS EMPREENDIMENTOS'!#REF!)+'DADOS DOS EMPREENDIMENTOS'!#REF!,IF(BH74='DADOS DOS EMPREENDIMENTOS'!#REF!,'DADOS DOS EMPREENDIMENTOS'!#REF!,BJ74*(1-'DADOS DOS EMPREENDIMENTOS'!#REF!-'DADOS DOS EMPREENDIMENTOS'!#REF!))))","v":{"$error":"#REF!"}},null,28,"2011-09-01",0,{"$f":"IF(BM74<'DADOS DOS EMPREENDIMENTOS'!BO$11,0,IF(BM74='DADOS DOS EMPREENDIMENTOS'!BO$11,SUM(BO$46:BO74)*(1-'DADOS DOS EMPREENDIMENTOS'!#REF!-'DADOS DOS EMPREENDIMENTOS'!#REF!)+'DADOS DOS EMPREENDIMENTOS'!#REF!,IF(BM74='DADOS DOS EMPREENDIMENTOS'!BO$12,'DADOS DOS EMPREENDIMENTOS'!#REF!,BO74*(1-'DADOS DOS EMPREENDIMENTOS'!#REF!-'DADOS DOS EMPREENDIMENTOS'!#REF!))))","v":{"$error":"#REF!"}},null,28,"2011-09-01",0,{"$f":"IF(BR74<'DADOS DOS EMPREENDIMENTOS'!BT$11,0,IF(BR74='DADOS DOS EMPREENDIMENTOS'!BT$11,SUM(BT$46:BT74)*(1-'DADOS DOS EMPREENDIMENTOS'!#REF!-'DADOS DOS EMPREENDIMENTOS'!#REF!)+'DADOS DOS EMPREENDIMENTOS'!#REF!,IF(BR74='DADOS DOS EMPREENDIMENTOS'!BT$12,'DADOS DOS EMPREENDIMENTOS'!#REF!,BT74*(1-'DADOS DOS EMPREENDIMENTOS'!#REF!-'DADOS DOS EMPREENDIMENTOS'!#REF!))))","v":{"$error":"#REF!"}},null,28,"2011-09-01",0,{"$f":"IF(BW74<'DADOS DOS EMPREENDIMENTOS'!BY$11,0,IF(BW74='DADOS DOS EMPREENDIMENTOS'!BY$11,SUM(BY$46:BY74)*(1-'DADOS DOS EMPREENDIMENTOS'!#REF!-'DADOS DOS EMPREENDIMENTOS'!#REF!)+'DADOS DOS EMPREENDIMENTOS'!#REF!,IF(BW74='DADOS DOS EMPREENDIMENTOS'!BY$12,'DADOS DOS EMPREENDIMENTOS'!#REF!,BY74*(1-'DADOS DOS EMPREENDIMENTOS'!#REF!-'DADOS DOS EMPREENDIMENTOS'!#REF!))))","v":{"$error":"#REF!"}},null,28,"2011-09-01",0,{"$f":"IF(CB74<'DADOS DOS EMPREENDIMENTOS'!CD$11,0,IF(CB74='DADOS DOS EMPREENDIMENTOS'!CD$11,SUM(CD$46:CD74)*(1-'DADOS DOS EMPREENDIMENTOS'!#REF!-'DADOS DOS EMPREENDIMENTOS'!#REF!)+'DADOS DOS EMPREENDIMENTOS'!#REF!,IF(CB74='DADOS DOS EMPREENDIMENTOS'!CD$12,'DADOS DOS EMPREENDIMENTOS'!#REF!,CD74*(1-'DADOS DOS EMPREENDIMENTOS'!#REF!-'DADOS DOS EMPREENDIMENTOS'!#REF!))))","v":{"$error":"#REF!"}}]
[null,null,null,null,null,null,null,null,null,null,null,null,null,null,29,null,null,null,null,29,null,null,null,null,29,null,null,null,null,29,"2011-10-01",0,{"$f":"IF(AD75<'DADOS DOS EMPREENDIMENTOS'!AF$11,0,IF(AD75='DADOS DOS EMPREENDIMENTOS'!AF$11,SUM(AF$46:AF75)*(1-'DADOS DOS EMPREENDIMENTOS'!#REF!-'DADOS DOS EMPREENDIMENTOS'!#REF!)+'DADOS DOS EMPREENDIMENTOS'!#REF!,IF(AD75='DADOS DOS EMPREENDIMENTOS'!#REF!,'DADOS DOS EMPREENDIMENTOS'!#REF!,AF75*(1-'DADOS DOS EMPREENDIMENTOS'!#REF!-'DADOS DOS EMPREENDIMENTOS'!#REF!))))","v":{"$error":"#REF!"}},null,29,"2011-10-01",0,{"$f":"IF(AI75<'DADOS DOS EMPREENDIMENTOS'!AK$11,0,IF(AI75='DADOS DOS EMPREENDIMENTOS'!AK$11,SUM(AK$46:AK75)*(1-'DADOS DOS EMPREENDIMENTOS'!#REF!-'DADOS DOS EMPREENDIMENTOS'!#REF!)+'DADOS DOS EMPREENDIMENTOS'!#REF!,IF(AI75='DADOS DOS EMPREENDIMENTOS'!#REF!,'DADOS DOS EMPREENDIMENTOS'!#REF!,AK75*(1-'DADOS DOS EMPREENDIMENTOS'!#REF!-'DADOS DOS EMPREENDIMENTOS'!#REF!))))","v":{"$error":"#REF!"}},null,29,"2011-10-01",0,{"$f":"IF(AN75<'DADOS DOS EMPREENDIMENTOS'!AP$11,0,IF(AN75='DADOS DOS EMPREENDIMENTOS'!AP$11,SUM(AP$46:AP75)*(1-'DADOS DOS EMPREENDIMENTOS'!#REF!-'DADOS DOS EMPREENDIMENTOS'!#REF!)+'DADOS DOS EMPREENDIMENTOS'!#REF!,IF(AN75='DADOS DOS EMPREENDIMENTOS'!#REF!,'DADOS DOS EMPREENDIMENTOS'!#REF!,AP75*(1-'DADOS DOS EMPREENDIMENTOS'!#REF!-'DADOS DOS EMPREENDIMENTOS'!#REF!))))","v":{"$error":"#REF!"}},null,29,"2011-10-01",0,{"$f":"IF(AS75<'DADOS DOS EMPREENDIMENTOS'!AU$11,0,IF(AS75='DADOS DOS EMPREENDIMENTOS'!AU$11,SUM(AU$46:AU75)*(1-'DADOS DOS EMPREENDIMENTOS'!#REF!-'DADOS DOS EMPREENDIMENTOS'!#REF!)+'DADOS DOS EMPREENDIMENTOS'!#REF!,IF(AS75='DADOS DOS EMPREENDIMENTOS'!#REF!,'DADOS DOS EMPREENDIMENTOS'!#REF!,AU75*(1-'DADOS DOS EMPREENDIMENTOS'!#REF!-'DADOS DOS EMPREENDIMENTOS'!#REF!))))","v":{"$error":"#REF!"}},null,29,"2011-10-01",0,{"$f":"IF(AX75<'DADOS DOS EMPREENDIMENTOS'!AZ$11,0,IF(AX75='DADOS DOS EMPREENDIMENTOS'!AZ$11,SUM(AZ$46:AZ75)*(1-'DADOS DOS EMPREENDIMENTOS'!#REF!-'DADOS DOS EMPREENDIMENTOS'!#REF!)+'DADOS DOS EMPREENDIMENTOS'!#REF!,IF(AX75='DADOS DOS EMPREENDIMENTOS'!#REF!,'DADOS DOS EMPREENDIMENTOS'!#REF!,AZ75*(1-'DADOS DOS EMPREENDIMENTOS'!#REF!-'DADOS DOS EMPREENDIMENTOS'!#REF!))))","v":{"$error":"#REF!"}},null,29,"2011-10-01",0,{"$f":"IF(BC75<'DADOS DOS EMPREENDIMENTOS'!BE$11,0,IF(BC75='DADOS DOS EMPREENDIMENTOS'!BE$11,SUM(BE$46:BE75)*(1-'DADOS DOS EMPREENDIMENTOS'!#REF!-'DADOS DOS EMPREENDIMENTOS'!#REF!)+'DADOS DOS EMPREENDIMENTOS'!#REF!,IF(BC75='DADOS DOS EMPREENDIMENTOS'!#REF!,'DADOS DOS EMPREENDIMENTOS'!#REF!,BE75*(1-'DADOS DOS EMPREENDIMENTOS'!#REF!-'DADOS DOS EMPREENDIMENTOS'!#REF!))))","v":{"$error":"#REF!"}},null,29,"2011-10-01",0,{"$f":"IF(BH75<'DADOS DOS EMPREENDIMENTOS'!BJ$11,0,IF(BH75='DADOS DOS EMPREENDIMENTOS'!BJ$11,SUM(BJ$46:BJ75)*(1-'DADOS DOS EMPREENDIMENTOS'!#REF!-'DADOS DOS EMPREENDIMENTOS'!#REF!)+'DADOS DOS EMPREENDIMENTOS'!#REF!,IF(BH75='DADOS DOS EMPREENDIMENTOS'!#REF!,'DADOS DOS EMPREENDIMENTOS'!#REF!,BJ75*(1-'DADOS DOS EMPREENDIMENTOS'!#REF!-'DADOS DOS EMPREENDIMENTOS'!#REF!))))","v":{"$error":"#REF!"}},null,29,"2011-10-01",0,{"$f":"IF(BM75<'DADOS DOS EMPREENDIMENTOS'!BO$11,0,IF(BM75='DADOS DOS EMPREENDIMENTOS'!BO$11,SUM(BO$46:BO75)*(1-'DADOS DOS EMPREENDIMENTOS'!#REF!-'DADOS DOS EMPREENDIMENTOS'!#REF!)+'DADOS DOS EMPREENDIMENTOS'!#REF!,IF(BM75='DADOS DOS EMPREENDIMENTOS'!BO$12,'DADOS DOS EMPREENDIMENTOS'!#REF!,BO75*(1-'DADOS DOS EMPREENDIMENTOS'!#REF!-'DADOS DOS EMPREENDIMENTOS'!#REF!))))","v":{"$error":"#REF!"}},null,29,"2011-10-01",0,{"$f":"IF(BR75<'DADOS DOS EMPREENDIMENTOS'!BT$11,0,IF(BR75='DADOS DOS EMPREENDIMENTOS'!BT$11,SUM(BT$46:BT75)*(1-'DADOS DOS EMPREENDIMENTOS'!#REF!-'DADOS DOS EMPREENDIMENTOS'!#REF!)+'DADOS DOS EMPREENDIMENTOS'!#REF!,IF(BR75='DADOS DOS EMPREENDIMENTOS'!BT$12,'DADOS DOS EMPREENDIMENTOS'!#REF!,BT75*(1-'DADOS DOS EMPREENDIMENTOS'!#REF!-'DADOS DOS EMPREENDIMENTOS'!#REF!))))","v":{"$error":"#REF!"}},null,29,"2011-10-01",0,{"$f":"IF(BW75<'DADOS DOS EMPREENDIMENTOS'!BY$11,0,IF(BW75='DADOS DOS EMPREENDIMENTOS'!BY$11,SUM(BY$46:BY75)*(1-'DADOS DOS EMPREENDIMENTOS'!#REF!-'DADOS DOS EMPREENDIMENTOS'!#REF!)+'DADOS DOS EMPREENDIMENTOS'!#REF!,IF(BW75='DADOS DOS EMPREENDIMENTOS'!BY$12,'DADOS DOS EMPREENDIMENTOS'!#REF!,BY75*(1-'DADOS DOS EMPREENDIMENTOS'!#REF!-'DADOS DOS EMPREENDIMENTOS'!#REF!))))","v":{"$error":"#REF!"}},null,29,"2011-10-01",0,{"$f":"IF(CB75<'DADOS DOS EMPREENDIMENTOS'!CD$11,0,IF(CB75='DADOS DOS EMPREENDIMENTOS'!CD$11,SUM(CD$46:CD75)*(1-'DADOS DOS EMPREENDIMENTOS'!#REF!-'DADOS DOS EMPREENDIMENTOS'!#REF!)+'DADOS DOS EMPREENDIMENTOS'!#REF!,IF(CB75='DADOS DOS EMPREENDIMENTOS'!CD$12,'DADOS DOS EMPREENDIMENTOS'!#REF!,CD75*(1-'DADOS DOS EMPREENDIMENTOS'!#REF!-'DADOS DOS EMPREENDIMENTOS'!#REF!))))","v":{"$error":"#REF!"}}]
[null,null,null,null,null,null,null,null,null,null,null,null,null,null,30,null,null,null,null,30,null,null,null,null,30,null,null,null,null,30,"2011-11-01",0,{"$f":"IF(AD76<'DADOS DOS EMPREENDIMENTOS'!AF$11,0,IF(AD76='DADOS DOS EMPREENDIMENTOS'!AF$11,SUM(AF$46:AF76)*(1-'DADOS DOS EMPREENDIMENTOS'!#REF!-'DADOS DOS EMPREENDIMENTOS'!#REF!)+'DADOS DOS EMPREENDIMENTOS'!#REF!,IF(AD76='DADOS DOS EMPREENDIMENTOS'!#REF!,'DADOS DOS EMPREENDIMENTOS'!#REF!,AF76*(1-'DADOS DOS EMPREENDIMENTOS'!#REF!-'DADOS DOS EMPREENDIMENTOS'!#REF!))))","v":{"$error":"#REF!"}},null,30,"2011-11-01",0,{"$f":"IF(AI76<'DADOS DOS EMPREENDIMENTOS'!AK$11,0,IF(AI76='DADOS DOS EMPREENDIMENTOS'!AK$11,SUM(AK$46:AK76)*(1-'DADOS DOS EMPREENDIMENTOS'!#REF!-'DADOS DOS EMPREENDIMENTOS'!#REF!)+'DADOS DOS EMPREENDIMENTOS'!#REF!,IF(AI76='DADOS DOS EMPREENDIMENTOS'!#REF!,'DADOS DOS EMPREENDIMENTOS'!#REF!,AK76*(1-'DADOS DOS EMPREENDIMENTOS'!#REF!-'DADOS DOS EMPREENDIMENTOS'!#REF!))))","v":{"$error":"#REF!"}},null,30,"2011-11-01",0,{"$f":"IF(AN76<'DADOS DOS EMPREENDIMENTOS'!AP$11,0,IF(AN76='DADOS DOS EMPREENDIMENTOS'!AP$11,SUM(AP$46:AP76)*(1-'DADOS DOS EMPREENDIMENTOS'!#REF!-'DADOS DOS EMPREENDIMENTOS'!#REF!)+'DADOS DOS EMPREENDIMENTOS'!#REF!,IF(AN76='DADOS DOS EMPREENDIMENTOS'!#REF!,'DADOS DOS EMPREENDIMENTOS'!#REF!,AP76*(1-'DADOS DOS EMPREENDIMENTOS'!#REF!-'DADOS DOS EMPREENDIMENTOS'!#REF!))))","v":{"$error":"#REF!"}},null,30,"2011-11-01",0,{"$f":"IF(AS76<'DADOS DOS EMPREENDIMENTOS'!AU$11,0,IF(AS76='DADOS DOS EMPREENDIMENTOS'!AU$11,SUM(AU$46:AU76)*(1-'DADOS DOS EMPREENDIMENTOS'!#REF!-'DADOS DOS EMPREENDIMENTOS'!#REF!)+'DADOS DOS EMPREENDIMENTOS'!#REF!,IF(AS76='DADOS DOS EMPREENDIMENTOS'!#REF!,'DADOS DOS EMPREENDIMENTOS'!#REF!,AU76*(1-'DADOS DOS EMPREENDIMENTOS'!#REF!-'DADOS DOS EMPREENDIMENTOS'!#REF!))))","v":{"$error":"#REF!"}},null,30,"2011-11-01",0,{"$f":"IF(AX76<'DADOS DOS EMPREENDIMENTOS'!AZ$11,0,IF(AX76='DADOS DOS EMPREENDIMENTOS'!AZ$11,SUM(AZ$46:AZ76)*(1-'DADOS DOS EMPREENDIMENTOS'!#REF!-'DADOS DOS EMPREENDIMENTOS'!#REF!)+'DADOS DOS EMPREENDIMENTOS'!#REF!,IF(AX76='DADOS DOS EMPREENDIMENTOS'!#REF!,'DADOS DOS EMPREENDIMENTOS'!#REF!,AZ76*(1-'DADOS DOS EMPREENDIMENTOS'!#REF!-'DADOS DOS EMPREENDIMENTOS'!#REF!))))","v":{"$error":"#REF!"}},null,30,"2011-11-01",0,{"$f":"IF(BC76<'DADOS DOS EMPREENDIMENTOS'!BE$11,0,IF(BC76='DADOS DOS EMPREENDIMENTOS'!BE$11,SUM(BE$46:BE76)*(1-'DADOS DOS EMPREENDIMENTOS'!#REF!-'DADOS DOS EMPREENDIMENTOS'!#REF!)+'DADOS DOS EMPREENDIMENTOS'!#REF!,IF(BC76='DADOS DOS EMPREENDIMENTOS'!#REF!,'DADOS DOS EMPREENDIMENTOS'!#REF!,BE76*(1-'DADOS DOS EMPREENDIMENTOS'!#REF!-'DADOS DOS EMPREENDIMENTOS'!#REF!))))","v":{"$error":"#REF!"}},null,30,"2011-11-01",0,{"$f":"IF(BH76<'DADOS DOS EMPREENDIMENTOS'!BJ$11,0,IF(BH76='DADOS DOS EMPREENDIMENTOS'!BJ$11,SUM(BJ$46:BJ76)*(1-'DADOS DOS EMPREENDIMENTOS'!#REF!-'DADOS DOS EMPREENDIMENTOS'!#REF!)+'DADOS DOS EMPREENDIMENTOS'!#REF!,IF(BH76='DADOS DOS EMPREENDIMENTOS'!#REF!,'DADOS DOS EMPREENDIMENTOS'!#REF!,BJ76*(1-'DADOS DOS EMPREENDIMENTOS'!#REF!-'DADOS DOS EMPREENDIMENTOS'!#REF!))))","v":{"$error":"#REF!"}},null,30,"2011-11-01",0,{"$f":"IF(BM76<'DADOS DOS EMPREENDIMENTOS'!BO$11,0,IF(BM76='DADOS DOS EMPREENDIMENTOS'!BO$11,SUM(BO$46:BO76)*(1-'DADOS DOS EMPREENDIMENTOS'!#REF!-'DADOS DOS EMPREENDIMENTOS'!#REF!)+'DADOS DOS EMPREENDIMENTOS'!#REF!,IF(BM76='DADOS DOS EMPREENDIMENTOS'!BO$12,'DADOS DOS EMPREENDIMENTOS'!#REF!,BO76*(1-'DADOS DOS EMPREENDIMENTOS'!#REF!-'DADOS DOS EMPREENDIMENTOS'!#REF!))))","v":{"$error":"#REF!"}},null,30,"2011-11-01",0,{"$f":"IF(BR76<'DADOS DOS EMPREENDIMENTOS'!BT$11,0,IF(BR76='DADOS DOS EMPREENDIMENTOS'!BT$11,SUM(BT$46:BT76)*(1-'DADOS DOS EMPREENDIMENTOS'!#REF!-'DADOS DOS EMPREENDIMENTOS'!#REF!)+'DADOS DOS EMPREENDIMENTOS'!#REF!,IF(BR76='DADOS DOS EMPREENDIMENTOS'!BT$12,'DADOS DOS EMPREENDIMENTOS'!#REF!,BT76*(1-'DADOS DOS EMPREENDIMENTOS'!#REF!-'DADOS DOS EMPREENDIMENTOS'!#REF!))))","v":{"$error":"#REF!"}},null,30,"2011-11-01",0,{"$f":"IF(BW76<'DADOS DOS EMPREENDIMENTOS'!BY$11,0,IF(BW76='DADOS DOS EMPREENDIMENTOS'!BY$11,SUM(BY$46:BY76)*(1-'DADOS DOS EMPREENDIMENTOS'!#REF!-'DADOS DOS EMPREENDIMENTOS'!#REF!)+'DADOS DOS EMPREENDIMENTOS'!#REF!,IF(BW76='DADOS DOS EMPREENDIMENTOS'!BY$12,'DADOS DOS EMPREENDIMENTOS'!#REF!,BY76*(1-'DADOS DOS EMPREENDIMENTOS'!#REF!-'DADOS DOS EMPREENDIMENTOS'!#REF!))))","v":{"$error":"#REF!"}},null,30,"2011-11-01",0,{"$f":"IF(CB76<'DADOS DOS EMPREENDIMENTOS'!CD$11,0,IF(CB76='DADOS DOS EMPREENDIMENTOS'!CD$11,SUM(CD$46:CD76)*(1-'DADOS DOS EMPREENDIMENTOS'!#REF!-'DADOS DOS EMPREENDIMENTOS'!#REF!)+'DADOS DOS EMPREENDIMENTOS'!#REF!,IF(CB76='DADOS DOS EMPREENDIMENTOS'!CD$12,'DADOS DOS EMPREENDIMENTOS'!#REF!,CD76*(1-'DADOS DOS EMPREENDIMENTOS'!#REF!-'DADOS DOS EMPREENDIMENTOS'!#REF!))))","v":{"$error":"#REF!"}}]
[null,null,null,null,null,null,null,null,null,null,null,null,null,null,31,null,null,null,null,31,null,null,null,null,31,null,null,null,null,31,"2011-12-01",0,{"$f":"IF(AD77<'DADOS DOS EMPREENDIMENTOS'!AF$11,0,IF(AD77='DADOS DOS EMPREENDIMENTOS'!AF$11,SUM(AF$46:AF77)*(1-'DADOS DOS EMPREENDIMENTOS'!#REF!-'DADOS DOS EMPREENDIMENTOS'!#REF!)+'DADOS DOS EMPREENDIMENTOS'!#REF!,IF(AD77='DADOS DOS EMPREENDIMENTOS'!#REF!,'DADOS DOS EMPREENDIMENTOS'!#REF!,AF77*(1-'DADOS DOS EMPREENDIMENTOS'!#REF!-'DADOS DOS EMPREENDIMENTOS'!#REF!))))","v":{"$error":"#REF!"}},null,31,"2011-12-01",0,{"$f":"IF(AI77<'DADOS DOS EMPREENDIMENTOS'!AK$11,0,IF(AI77='DADOS DOS EMPREENDIMENTOS'!AK$11,SUM(AK$46:AK77)*(1-'DADOS DOS EMPREENDIMENTOS'!#REF!-'DADOS DOS EMPREENDIMENTOS'!#REF!)+'DADOS DOS EMPREENDIMENTOS'!#REF!,IF(AI77='DADOS DOS EMPREENDIMENTOS'!#REF!,'DADOS DOS EMPREENDIMENTOS'!#REF!,AK77*(1-'DADOS DOS EMPREENDIMENTOS'!#REF!-'DADOS DOS EMPREENDIMENTOS'!#REF!))))","v":{"$error":"#REF!"}},null,31,"2011-12-01",0,{"$f":"IF(AN77<'DADOS DOS EMPREENDIMENTOS'!AP$11,0,IF(AN77='DADOS DOS EMPREENDIMENTOS'!AP$11,SUM(AP$46:AP77)*(1-'DADOS DOS EMPREENDIMENTOS'!#REF!-'DADOS DOS EMPREENDIMENTOS'!#REF!)+'DADOS DOS EMPREENDIMENTOS'!#REF!,IF(AN77='DADOS DOS EMPREENDIMENTOS'!#REF!,'DADOS DOS EMPREENDIMENTOS'!#REF!,AP77*(1-'DADOS DOS EMPREENDIMENTOS'!#REF!-'DADOS DOS EMPREENDIMENTOS'!#REF!))))","v":{"$error":"#REF!"}},null,31,"2011-12-01",0,{"$f":"IF(AS77<'DADOS DOS EMPREENDIMENTOS'!AU$11,0,IF(AS77='DADOS DOS EMPREENDIMENTOS'!AU$11,SUM(AU$46:AU77)*(1-'DADOS DOS EMPREENDIMENTOS'!#REF!-'DADOS DOS EMPREENDIMENTOS'!#REF!)+'DADOS DOS EMPREENDIMENTOS'!#REF!,IF(AS77='DADOS DOS EMPREENDIMENTOS'!#REF!,'DADOS DOS EMPREENDIMENTOS'!#REF!,AU77*(1-'DADOS DOS EMPREENDIMENTOS'!#REF!-'DADOS DOS EMPREENDIMENTOS'!#REF!))))","v":{"$error":"#REF!"}},null,31,"2011-12-01",0,{"$f":"IF(AX77<'DADOS DOS EMPREENDIMENTOS'!AZ$11,0,IF(AX77='DADOS DOS EMPREENDIMENTOS'!AZ$11,SUM(AZ$46:AZ77)*(1-'DADOS DOS EMPREENDIMENTOS'!#REF!-'DADOS DOS EMPREENDIMENTOS'!#REF!)+'DADOS DOS EMPREENDIMENTOS'!#REF!,IF(AX77='DADOS DOS EMPREENDIMENTOS'!#REF!,'DADOS DOS EMPREENDIMENTOS'!#REF!,AZ77*(1-'DADOS DOS EMPREENDIMENTOS'!#REF!-'DADOS DOS EMPREENDIMENTOS'!#REF!))))","v":{"$error":"#REF!"}},null,31,"2011-12-01",0,{"$f":"IF(BC77<'DADOS DOS EMPREENDIMENTOS'!BE$11,0,IF(BC77='DADOS DOS EMPREENDIMENTOS'!BE$11,SUM(BE$46:BE77)*(1-'DADOS DOS EMPREENDIMENTOS'!#REF!-'DADOS DOS EMPREENDIMENTOS'!#REF!)+'DADOS DOS EMPREENDIMENTOS'!#REF!,IF(BC77='DADOS DOS EMPREENDIMENTOS'!#REF!,'DADOS DOS EMPREENDIMENTOS'!#REF!,BE77*(1-'DADOS DOS EMPREENDIMENTOS'!#REF!-'DADOS DOS EMPREENDIMENTOS'!#REF!))))","v":{"$error":"#REF!"}},null,31,"2011-12-01",0,{"$f":"IF(BH77<'DADOS DOS EMPREENDIMENTOS'!BJ$11,0,IF(BH77='DADOS DOS EMPREENDIMENTOS'!BJ$11,SUM(BJ$46:BJ77)*(1-'DADOS DOS EMPREENDIMENTOS'!#REF!-'DADOS DOS EMPREENDIMENTOS'!#REF!)+'DADOS DOS EMPREENDIMENTOS'!#REF!,IF(BH77='DADOS DOS EMPREENDIMENTOS'!#REF!,'DADOS DOS EMPREENDIMENTOS'!#REF!,BJ77*(1-'DADOS DOS EMPREENDIMENTOS'!#REF!-'DADOS DOS EMPREENDIMENTOS'!#REF!))))","v":{"$error":"#REF!"}},null,31,"2011-12-01",0,{"$f":"IF(BM77<'DADOS DOS EMPREENDIMENTOS'!BO$11,0,IF(BM77='DADOS DOS EMPREENDIMENTOS'!BO$11,SUM(BO$46:BO77)*(1-'DADOS DOS EMPREENDIMENTOS'!#REF!-'DADOS DOS EMPREENDIMENTOS'!#REF!)+'DADOS DOS EMPREENDIMENTOS'!#REF!,IF(BM77='DADOS DOS EMPREENDIMENTOS'!BO$12,'DADOS DOS EMPREENDIMENTOS'!#REF!,BO77*(1-'DADOS DOS EMPREENDIMENTOS'!#REF!-'DADOS DOS EMPREENDIMENTOS'!#REF!))))","v":{"$error":"#REF!"}},null,31,"2011-12-01",0,{"$f":"IF(BR77<'DADOS DOS EMPREENDIMENTOS'!BT$11,0,IF(BR77='DADOS DOS EMPREENDIMENTOS'!BT$11,SUM(BT$46:BT77)*(1-'DADOS DOS EMPREENDIMENTOS'!#REF!-'DADOS DOS EMPREENDIMENTOS'!#REF!)+'DADOS DOS EMPREENDIMENTOS'!#REF!,IF(BR77='DADOS DOS EMPREENDIMENTOS'!BT$12,'DADOS DOS EMPREENDIMENTOS'!#REF!,BT77*(1-'DADOS DOS EMPREENDIMENTOS'!#REF!-'DADOS DOS EMPREENDIMENTOS'!#REF!))))","v":{"$error":"#REF!"}},null,31,"2011-12-01",0,{"$f":"IF(BW77<'DADOS DOS EMPREENDIMENTOS'!BY$11,0,IF(BW77='DADOS DOS EMPREENDIMENTOS'!BY$11,SUM(BY$46:BY77)*(1-'DADOS DOS EMPREENDIMENTOS'!#REF!-'DADOS DOS EMPREENDIMENTOS'!#REF!)+'DADOS DOS EMPREENDIMENTOS'!#REF!,IF(BW77='DADOS DOS EMPREENDIMENTOS'!BY$12,'DADOS DOS EMPREENDIMENTOS'!#REF!,BY77*(1-'DADOS DOS EMPREENDIMENTOS'!#REF!-'DADOS DOS EMPREENDIMENTOS'!#REF!))))","v":{"$error":"#REF!"}},null,31,"2011-12-01",0,{"$f":"IF(CB77<'DADOS DOS EMPREENDIMENTOS'!CD$11,0,IF(CB77='DADOS DOS EMPREENDIMENTOS'!CD$11,SUM(CD$46:CD77)*(1-'DADOS DOS EMPREENDIMENTOS'!#REF!-'DADOS DOS EMPREENDIMENTOS'!#REF!)+'DADOS DOS EMPREENDIMENTOS'!#REF!,IF(CB77='DADOS DOS EMPREENDIMENTOS'!CD$12,'DADOS DOS EMPREENDIMENTOS'!#REF!,CD77*(1-'DADOS DOS EMPREENDIMENTOS'!#REF!-'DADOS DOS EMPREENDIMENTOS'!#REF!))))","v":{"$error":"#REF!"}}]
[null,null,null,null,null,null,null,null,null,null,null,null,null,null,32,null,null,null,null,32,null,null,null,null,32,null,null,null,null,32,"2012-01-01",0,{"$f":"IF(AD78<'DADOS DOS EMPREENDIMENTOS'!AF$11,0,IF(AD78='DADOS DOS EMPREENDIMENTOS'!AF$11,SUM(AF$46:AF78)*(1-'DADOS DOS EMPREENDIMENTOS'!#REF!-'DADOS DOS EMPREENDIMENTOS'!#REF!)+'DADOS DOS EMPREENDIMENTOS'!#REF!,IF(AD78='DADOS DOS EMPREENDIMENTOS'!#REF!,'DADOS DOS EMPREENDIMENTOS'!#REF!,AF78*(1-'DADOS DOS EMPREENDIMENTOS'!#REF!-'DADOS DOS EMPREENDIMENTOS'!#REF!))))","v":{"$error":"#REF!"}},null,32,"2012-01-01",0,{"$f":"IF(AI78<'DADOS DOS EMPREENDIMENTOS'!AK$11,0,IF(AI78='DADOS DOS EMPREENDIMENTOS'!AK$11,SUM(AK$46:AK78)*(1-'DADOS DOS EMPREENDIMENTOS'!#REF!-'DADOS DOS EMPREENDIMENTOS'!#REF!)+'DADOS DOS EMPREENDIMENTOS'!#REF!,IF(AI78='DADOS DOS EMPREENDIMENTOS'!#REF!,'DADOS DOS EMPREENDIMENTOS'!#REF!,AK78*(1-'DADOS DOS EMPREENDIMENTOS'!#REF!-'DADOS DOS EMPREENDIMENTOS'!#REF!))))","v":{"$error":"#REF!"}},null,32,"2012-01-01",0,{"$f":"IF(AN78<'DADOS DOS EMPREENDIMENTOS'!AP$11,0,IF(AN78='DADOS DOS EMPREENDIMENTOS'!AP$11,SUM(AP$46:AP78)*(1-'DADOS DOS EMPREENDIMENTOS'!#REF!-'DADOS DOS EMPREENDIMENTOS'!#REF!)+'DADOS DOS EMPREENDIMENTOS'!#REF!,IF(AN78='DADOS DOS EMPREENDIMENTOS'!#REF!,'DADOS DOS EMPREENDIMENTOS'!#REF!,AP78*(1-'DADOS DOS EMPREENDIMENTOS'!#REF!-'DADOS DOS EMPREENDIMENTOS'!#REF!))))","v":{"$error":"#REF!"}},null,32,"2012-01-01",0,{"$f":"IF(AS78<'DADOS DOS EMPREENDIMENTOS'!AU$11,0,IF(AS78='DADOS DOS EMPREENDIMENTOS'!AU$11,SUM(AU$46:AU78)*(1-'DADOS DOS EMPREENDIMENTOS'!#REF!-'DADOS DOS EMPREENDIMENTOS'!#REF!)+'DADOS DOS EMPREENDIMENTOS'!#REF!,IF(AS78='DADOS DOS EMPREENDIMENTOS'!#REF!,'DADOS DOS EMPREENDIMENTOS'!#REF!,AU78*(1-'DADOS DOS EMPREENDIMENTOS'!#REF!-'DADOS DOS EMPREENDIMENTOS'!#REF!))))","v":{"$error":"#REF!"}},null,32,"2012-01-01",0,{"$f":"IF(AX78<'DADOS DOS EMPREENDIMENTOS'!AZ$11,0,IF(AX78='DADOS DOS EMPREENDIMENTOS'!AZ$11,SUM(AZ$46:AZ78)*(1-'DADOS DOS EMPREENDIMENTOS'!#REF!-'DADOS DOS EMPREENDIMENTOS'!#REF!)+'DADOS DOS EMPREENDIMENTOS'!#REF!,IF(AX78='DADOS DOS EMPREENDIMENTOS'!#REF!,'DADOS DOS EMPREENDIMENTOS'!#REF!,AZ78*(1-'DADOS DOS EMPREENDIMENTOS'!#REF!-'DADOS DOS EMPREENDIMENTOS'!#REF!))))","v":{"$error":"#REF!"}},null,32,"2012-01-01",0,{"$f":"IF(BC78<'DADOS DOS EMPREENDIMENTOS'!BE$11,0,IF(BC78='DADOS DOS EMPREENDIMENTOS'!BE$11,SUM(BE$46:BE78)*(1-'DADOS DOS EMPREENDIMENTOS'!#REF!-'DADOS DOS EMPREENDIMENTOS'!#REF!)+'DADOS DOS EMPREENDIMENTOS'!#REF!,IF(BC78='DADOS DOS EMPREENDIMENTOS'!#REF!,'DADOS DOS EMPREENDIMENTOS'!#REF!,BE78*(1-'DADOS DOS EMPREENDIMENTOS'!#REF!-'DADOS DOS EMPREENDIMENTOS'!#REF!))))","v":{"$error":"#REF!"}},null,32,"2012-01-01",0,{"$f":"IF(BH78<'DADOS DOS EMPREENDIMENTOS'!BJ$11,0,IF(BH78='DADOS DOS EMPREENDIMENTOS'!BJ$11,SUM(BJ$46:BJ78)*(1-'DADOS DOS EMPREENDIMENTOS'!#REF!-'DADOS DOS EMPREENDIMENTOS'!#REF!)+'DADOS DOS EMPREENDIMENTOS'!#REF!,IF(BH78='DADOS DOS EMPREENDIMENTOS'!#REF!,'DADOS DOS EMPREENDIMENTOS'!#REF!,BJ78*(1-'DADOS DOS EMPREENDIMENTOS'!#REF!-'DADOS DOS EMPREENDIMENTOS'!#REF!))))","v":{"$error":"#REF!"}},null,32,"2012-01-01",0,{"$f":"IF(BM78<'DADOS DOS EMPREENDIMENTOS'!BO$11,0,IF(BM78='DADOS DOS EMPREENDIMENTOS'!BO$11,SUM(BO$46:BO78)*(1-'DADOS DOS EMPREENDIMENTOS'!#REF!-'DADOS DOS EMPREENDIMENTOS'!#REF!)+'DADOS DOS EMPREENDIMENTOS'!#REF!,IF(BM78='DADOS DOS EMPREENDIMENTOS'!BO$12,'DADOS DOS EMPREENDIMENTOS'!#REF!,BO78*(1-'DADOS DOS EMPREENDIMENTOS'!#REF!-'DADOS DOS EMPREENDIMENTOS'!#REF!))))","v":{"$error":"#REF!"}},null,32,"2012-01-01",0,{"$f":"IF(BR78<'DADOS DOS EMPREENDIMENTOS'!BT$11,0,IF(BR78='DADOS DOS EMPREENDIMENTOS'!BT$11,SUM(BT$46:BT78)*(1-'DADOS DOS EMPREENDIMENTOS'!#REF!-'DADOS DOS EMPREENDIMENTOS'!#REF!)+'DADOS DOS EMPREENDIMENTOS'!#REF!,IF(BR78='DADOS DOS EMPREENDIMENTOS'!BT$12,'DADOS DOS EMPREENDIMENTOS'!#REF!,BT78*(1-'DADOS DOS EMPREENDIMENTOS'!#REF!-'DADOS DOS EMPREENDIMENTOS'!#REF!))))","v":{"$error":"#REF!"}},null,32,"2012-01-01",0,{"$f":"IF(BW78<'DADOS DOS EMPREENDIMENTOS'!BY$11,0,IF(BW78='DADOS DOS EMPREENDIMENTOS'!BY$11,SUM(BY$46:BY78)*(1-'DADOS DOS EMPREENDIMENTOS'!#REF!-'DADOS DOS EMPREENDIMENTOS'!#REF!)+'DADOS DOS EMPREENDIMENTOS'!#REF!,IF(BW78='DADOS DOS EMPREENDIMENTOS'!BY$12,'DADOS DOS EMPREENDIMENTOS'!#REF!,BY78*(1-'DADOS DOS EMPREENDIMENTOS'!#REF!-'DADOS DOS EMPREENDIMENTOS'!#REF!))))","v":{"$error":"#REF!"}},null,32,"2012-01-01",0,{"$f":"IF(CB78<'DADOS DOS EMPREENDIMENTOS'!CD$11,0,IF(CB78='DADOS DOS EMPREENDIMENTOS'!CD$11,SUM(CD$46:CD78)*(1-'DADOS DOS EMPREENDIMENTOS'!#REF!-'DADOS DOS EMPREENDIMENTOS'!#REF!)+'DADOS DOS EMPREENDIMENTOS'!#REF!,IF(CB78='DADOS DOS EMPREENDIMENTOS'!CD$12,'DADOS DOS EMPREENDIMENTOS'!#REF!,CD78*(1-'DADOS DOS EMPREENDIMENTOS'!#REF!-'DADOS DOS EMPREENDIMENTOS'!#REF!))))","v":{"$error":"#REF!"}}]
[null,null,null,null,null,null,null,null,null,null,null,null,null,null,33,null,null,null,null,33,null,null,null,null,33,null,null,null,null,33,"2012-02-01",0,{"$f":"IF(AD79<'DADOS DOS EMPREENDIMENTOS'!AF$11,0,IF(AD79='DADOS DOS EMPREENDIMENTOS'!AF$11,SUM(AF$46:AF79)*(1-'DADOS DOS EMPREENDIMENTOS'!#REF!-'DADOS DOS EMPREENDIMENTOS'!#REF!)+'DADOS DOS EMPREENDIMENTOS'!#REF!,IF(AD79='DADOS DOS EMPREENDIMENTOS'!#REF!,'DADOS DOS EMPREENDIMENTOS'!#REF!,AF79*(1-'DADOS DOS EMPREENDIMENTOS'!#REF!-'DADOS DOS EMPREENDIMENTOS'!#REF!))))","v":{"$error":"#REF!"}},null,33,"2012-02-01",0,{"$f":"IF(AI79<'DADOS DOS EMPREENDIMENTOS'!AK$11,0,IF(AI79='DADOS DOS EMPREENDIMENTOS'!AK$11,SUM(AK$46:AK79)*(1-'DADOS DOS EMPREENDIMENTOS'!#REF!-'DADOS DOS EMPREENDIMENTOS'!#REF!)+'DADOS DOS EMPREENDIMENTOS'!#REF!,IF(AI79='DADOS DOS EMPREENDIMENTOS'!#REF!,'DADOS DOS EMPREENDIMENTOS'!#REF!,AK79*(1-'DADOS DOS EMPREENDIMENTOS'!#REF!-'DADOS DOS EMPREENDIMENTOS'!#REF!))))","v":{"$error":"#REF!"}},null,33,"2012-02-01",0,{"$f":"IF(AN79<'DADOS DOS EMPREENDIMENTOS'!AP$11,0,IF(AN79='DADOS DOS EMPREENDIMENTOS'!AP$11,SUM(AP$46:AP79)*(1-'DADOS DOS EMPREENDIMENTOS'!#REF!-'DADOS DOS EMPREENDIMENTOS'!#REF!)+'DADOS DOS EMPREENDIMENTOS'!#REF!,IF(AN79='DADOS DOS EMPREENDIMENTOS'!#REF!,'DADOS DOS EMPREENDIMENTOS'!#REF!,AP79*(1-'DADOS DOS EMPREENDIMENTOS'!#REF!-'DADOS DOS EMPREENDIMENTOS'!#REF!))))","v":{"$error":"#REF!"}},null,33,"2012-02-01",0,{"$f":"IF(AS79<'DADOS DOS EMPREENDIMENTOS'!AU$11,0,IF(AS79='DADOS DOS EMPREENDIMENTOS'!AU$11,SUM(AU$46:AU79)*(1-'DADOS DOS EMPREENDIMENTOS'!#REF!-'DADOS DOS EMPREENDIMENTOS'!#REF!)+'DADOS DOS EMPREENDIMENTOS'!#REF!,IF(AS79='DADOS DOS EMPREENDIMENTOS'!#REF!,'DADOS DOS EMPREENDIMENTOS'!#REF!,AU79*(1-'DADOS DOS EMPREENDIMENTOS'!#REF!-'DADOS DOS EMPREENDIMENTOS'!#REF!))))","v":{"$error":"#REF!"}},null,33,"2012-02-01",0,{"$f":"IF(AX79<'DADOS DOS EMPREENDIMENTOS'!AZ$11,0,IF(AX79='DADOS DOS EMPREENDIMENTOS'!AZ$11,SUM(AZ$46:AZ79)*(1-'DADOS DOS EMPREENDIMENTOS'!#REF!-'DADOS DOS EMPREENDIMENTOS'!#REF!)+'DADOS DOS EMPREENDIMENTOS'!#REF!,IF(AX79='DADOS DOS EMPREENDIMENTOS'!#REF!,'DADOS DOS EMPREENDIMENTOS'!#REF!,AZ79*(1-'DADOS DOS EMPREENDIMENTOS'!#REF!-'DADOS DOS EMPREENDIMENTOS'!#REF!))))","v":{"$error":"#REF!"}},null,33,"2012-02-01",0,{"$f":"IF(BC79<'DADOS DOS EMPREENDIMENTOS'!BE$11,0,IF(BC79='DADOS DOS EMPREENDIMENTOS'!BE$11,SUM(BE$46:BE79)*(1-'DADOS DOS EMPREENDIMENTOS'!#REF!-'DADOS DOS EMPREENDIMENTOS'!#REF!)+'DADOS DOS EMPREENDIMENTOS'!#REF!,IF(BC79='DADOS DOS EMPREENDIMENTOS'!#REF!,'DADOS DOS EMPREENDIMENTOS'!#REF!,BE79*(1-'DADOS DOS EMPREENDIMENTOS'!#REF!-'DADOS DOS EMPREENDIMENTOS'!#REF!))))","v":{"$error":"#REF!"}},null,33,"2012-02-01",0,{"$f":"IF(BH79<'DADOS DOS EMPREENDIMENTOS'!BJ$11,0,IF(BH79='DADOS DOS EMPREENDIMENTOS'!BJ$11,SUM(BJ$46:BJ79)*(1-'DADOS DOS EMPREENDIMENTOS'!#REF!-'DADOS DOS EMPREENDIMENTOS'!#REF!)+'DADOS DOS EMPREENDIMENTOS'!#REF!,IF(BH79='DADOS DOS EMPREENDIMENTOS'!#REF!,'DADOS DOS EMPREENDIMENTOS'!#REF!,BJ79*(1-'DADOS DOS EMPREENDIMENTOS'!#REF!-'DADOS DOS EMPREENDIMENTOS'!#REF!))))","v":{"$error":"#REF!"}},null,33,"2012-02-01",0,{"$f":"IF(BM79<'DADOS DOS EMPREENDIMENTOS'!BO$11,0,IF(BM79='DADOS DOS EMPREENDIMENTOS'!BO$11,SUM(BO$46:BO79)*(1-'DADOS DOS EMPREENDIMENTOS'!#REF!-'DADOS DOS EMPREENDIMENTOS'!#REF!)+'DADOS DOS EMPREENDIMENTOS'!#REF!,IF(BM79='DADOS DOS EMPREENDIMENTOS'!BO$12,'DADOS DOS EMPREENDIMENTOS'!#REF!,BO79*(1-'DADOS DOS EMPREENDIMENTOS'!#REF!-'DADOS DOS EMPREENDIMENTOS'!#REF!))))","v":{"$error":"#REF!"}},null,33,"2012-02-01",0,{"$f":"IF(BR79<'DADOS DOS EMPREENDIMENTOS'!BT$11,0,IF(BR79='DADOS DOS EMPREENDIMENTOS'!BT$11,SUM(BT$46:BT79)*(1-'DADOS DOS EMPREENDIMENTOS'!#REF!-'DADOS DOS EMPREENDIMENTOS'!#REF!)+'DADOS DOS EMPREENDIMENTOS'!#REF!,IF(BR79='DADOS DOS EMPREENDIMENTOS'!BT$12,'DADOS DOS EMPREENDIMENTOS'!#REF!,BT79*(1-'DADOS DOS EMPREENDIMENTOS'!#REF!-'DADOS DOS EMPREENDIMENTOS'!#REF!))))","v":{"$error":"#REF!"}},null,33,"2012-02-01",0,{"$f":"IF(BW79<'DADOS DOS EMPREENDIMENTOS'!BY$11,0,IF(BW79='DADOS DOS EMPREENDIMENTOS'!BY$11,SUM(BY$46:BY79)*(1-'DADOS DOS EMPREENDIMENTOS'!#REF!-'DADOS DOS EMPREENDIMENTOS'!#REF!)+'DADOS DOS EMPREENDIMENTOS'!#REF!,IF(BW79='DADOS DOS EMPREENDIMENTOS'!BY$12,'DADOS DOS EMPREENDIMENTOS'!#REF!,BY79*(1-'DADOS DOS EMPREENDIMENTOS'!#REF!-'DADOS DOS EMPREENDIMENTOS'!#REF!))))","v":{"$error":"#REF!"}},null,33,"2012-02-01",0,{"$f":"IF(CB79<'DADOS DOS EMPREENDIMENTOS'!CD$11,0,IF(CB79='DADOS DOS EMPREENDIMENTOS'!CD$11,SUM(CD$46:CD79)*(1-'DADOS DOS EMPREENDIMENTOS'!#REF!-'DADOS DOS EMPREENDIMENTOS'!#REF!)+'DADOS DOS EMPREENDIMENTOS'!#REF!,IF(CB79='DADOS DOS EMPREENDIMENTOS'!CD$12,'DADOS DOS EMPREENDIMENTOS'!#REF!,CD79*(1-'DADOS DOS EMPREENDIMENTOS'!#REF!-'DADOS DOS EMPREENDIMENTOS'!#REF!))))","v":{"$error":"#REF!"}}]
[null,null,null,null,null,null,null,null,null,null,null,null,null,null,34,null,null,null,null,34,null,null,null,null,34,null,null,null,null,34,"2012-03-01",0,{"$f":"IF(AD80<'DADOS DOS EMPREENDIMENTOS'!AF$11,0,IF(AD80='DADOS DOS EMPREENDIMENTOS'!AF$11,SUM(AF$46:AF80)*(1-'DADOS DOS EMPREENDIMENTOS'!#REF!-'DADOS DOS EMPREENDIMENTOS'!#REF!)+'DADOS DOS EMPREENDIMENTOS'!#REF!,IF(AD80='DADOS DOS EMPREENDIMENTOS'!#REF!,'DADOS DOS EMPREENDIMENTOS'!#REF!,AF80*(1-'DADOS DOS EMPREENDIMENTOS'!#REF!-'DADOS DOS EMPREENDIMENTOS'!#REF!))))","v":{"$error":"#REF!"}},null,34,"2012-03-01",0,{"$f":"IF(AI80<'DADOS DOS EMPREENDIMENTOS'!AK$11,0,IF(AI80='DADOS DOS EMPREENDIMENTOS'!AK$11,SUM(AK$46:AK80)*(1-'DADOS DOS EMPREENDIMENTOS'!#REF!-'DADOS DOS EMPREENDIMENTOS'!#REF!)+'DADOS DOS EMPREENDIMENTOS'!#REF!,IF(AI80='DADOS DOS EMPREENDIMENTOS'!#REF!,'DADOS DOS EMPREENDIMENTOS'!#REF!,AK80*(1-'DADOS DOS EMPREENDIMENTOS'!#REF!-'DADOS DOS EMPREENDIMENTOS'!#REF!))))","v":{"$error":"#REF!"}},null,34,"2012-03-01",0,{"$f":"IF(AN80<'DADOS DOS EMPREENDIMENTOS'!AP$11,0,IF(AN80='DADOS DOS EMPREENDIMENTOS'!AP$11,SUM(AP$46:AP80)*(1-'DADOS DOS EMPREENDIMENTOS'!#REF!-'DADOS DOS EMPREENDIMENTOS'!#REF!)+'DADOS DOS EMPREENDIMENTOS'!#REF!,IF(AN80='DADOS DOS EMPREENDIMENTOS'!#REF!,'DADOS DOS EMPREENDIMENTOS'!#REF!,AP80*(1-'DADOS DOS EMPREENDIMENTOS'!#REF!-'DADOS DOS EMPREENDIMENTOS'!#REF!))))","v":{"$error":"#REF!"}},null,34,"2012-03-01",0,{"$f":"IF(AS80<'DADOS DOS EMPREENDIMENTOS'!AU$11,0,IF(AS80='DADOS DOS EMPREENDIMENTOS'!AU$11,SUM(AU$46:AU80)*(1-'DADOS DOS EMPREENDIMENTOS'!#REF!-'DADOS DOS EMPREENDIMENTOS'!#REF!)+'DADOS DOS EMPREENDIMENTOS'!#REF!,IF(AS80='DADOS DOS EMPREENDIMENTOS'!#REF!,'DADOS DOS EMPREENDIMENTOS'!#REF!,AU80*(1-'DADOS DOS EMPREENDIMENTOS'!#REF!-'DADOS DOS EMPREENDIMENTOS'!#REF!))))","v":{"$error":"#REF!"}},null,34,"2012-03-01",0,{"$f":"IF(AX80<'DADOS DOS EMPREENDIMENTOS'!AZ$11,0,IF(AX80='DADOS DOS EMPREENDIMENTOS'!AZ$11,SUM(AZ$46:AZ80)*(1-'DADOS DOS EMPREENDIMENTOS'!#REF!-'DADOS DOS EMPREENDIMENTOS'!#REF!)+'DADOS DOS EMPREENDIMENTOS'!#REF!,IF(AX80='DADOS DOS EMPREENDIMENTOS'!#REF!,'DADOS DOS EMPREENDIMENTOS'!#REF!,AZ80*(1-'DADOS DOS EMPREENDIMENTOS'!#REF!-'DADOS DOS EMPREENDIMENTOS'!#REF!))))","v":{"$error":"#REF!"}},null,34,"2012-03-01",0,{"$f":"IF(BC80<'DADOS DOS EMPREENDIMENTOS'!BE$11,0,IF(BC80='DADOS DOS EMPREENDIMENTOS'!BE$11,SUM(BE$46:BE80)*(1-'DADOS DOS EMPREENDIMENTOS'!#REF!-'DADOS DOS EMPREENDIMENTOS'!#REF!)+'DADOS DOS EMPREENDIMENTOS'!#REF!,IF(BC80='DADOS DOS EMPREENDIMENTOS'!#REF!,'DADOS DOS EMPREENDIMENTOS'!#REF!,BE80*(1-'DADOS DOS EMPREENDIMENTOS'!#REF!-'DADOS DOS EMPREENDIMENTOS'!#REF!))))","v":{"$error":"#REF!"}},null,34,"2012-03-01",0,{"$f":"IF(BH80<'DADOS DOS EMPREENDIMENTOS'!BJ$11,0,IF(BH80='DADOS DOS EMPREENDIMENTOS'!BJ$11,SUM(BJ$46:BJ80)*(1-'DADOS DOS EMPREENDIMENTOS'!#REF!-'DADOS DOS EMPREENDIMENTOS'!#REF!)+'DADOS DOS EMPREENDIMENTOS'!#REF!,IF(BH80='DADOS DOS EMPREENDIMENTOS'!#REF!,'DADOS DOS EMPREENDIMENTOS'!#REF!,BJ80*(1-'DADOS DOS EMPREENDIMENTOS'!#REF!-'DADOS DOS EMPREENDIMENTOS'!#REF!))))","v":{"$error":"#REF!"}},null,34,"2012-03-01",0,{"$f":"IF(BM80<'DADOS DOS EMPREENDIMENTOS'!BO$11,0,IF(BM80='DADOS DOS EMPREENDIMENTOS'!BO$11,SUM(BO$46:BO80)*(1-'DADOS DOS EMPREENDIMENTOS'!#REF!-'DADOS DOS EMPREENDIMENTOS'!#REF!)+'DADOS DOS EMPREENDIMENTOS'!#REF!,IF(BM80='DADOS DOS EMPREENDIMENTOS'!BO$12,'DADOS DOS EMPREENDIMENTOS'!#REF!,BO80*(1-'DADOS DOS EMPREENDIMENTOS'!#REF!-'DADOS DOS EMPREENDIMENTOS'!#REF!))))","v":{"$error":"#REF!"}},null,34,"2012-03-01",0,{"$f":"IF(BR80<'DADOS DOS EMPREENDIMENTOS'!BT$11,0,IF(BR80='DADOS DOS EMPREENDIMENTOS'!BT$11,SUM(BT$46:BT80)*(1-'DADOS DOS EMPREENDIMENTOS'!#REF!-'DADOS DOS EMPREENDIMENTOS'!#REF!)+'DADOS DOS EMPREENDIMENTOS'!#REF!,IF(BR80='DADOS DOS EMPREENDIMENTOS'!BT$12,'DADOS DOS EMPREENDIMENTOS'!#REF!,BT80*(1-'DADOS DOS EMPREENDIMENTOS'!#REF!-'DADOS DOS EMPREENDIMENTOS'!#REF!))))","v":{"$error":"#REF!"}},null,34,"2012-03-01",0,{"$f":"IF(BW80<'DADOS DOS EMPREENDIMENTOS'!BY$11,0,IF(BW80='DADOS DOS EMPREENDIMENTOS'!BY$11,SUM(BY$46:BY80)*(1-'DADOS DOS EMPREENDIMENTOS'!#REF!-'DADOS DOS EMPREENDIMENTOS'!#REF!)+'DADOS DOS EMPREENDIMENTOS'!#REF!,IF(BW80='DADOS DOS EMPREENDIMENTOS'!BY$12,'DADOS DOS EMPREENDIMENTOS'!#REF!,BY80*(1-'DADOS DOS EMPREENDIMENTOS'!#REF!-'DADOS DOS EMPREENDIMENTOS'!#REF!))))","v":{"$error":"#REF!"}},null,34,"2012-03-01",0,{"$f":"IF(CB80<'DADOS DOS EMPREENDIMENTOS'!CD$11,0,IF(CB80='DADOS DOS EMPREENDIMENTOS'!CD$11,SUM(CD$46:CD80)*(1-'DADOS DOS EMPREENDIMENTOS'!#REF!-'DADOS DOS EMPREENDIMENTOS'!#REF!)+'DADOS DOS EMPREENDIMENTOS'!#REF!,IF(CB80='DADOS DOS EMPREENDIMENTOS'!CD$12,'DADOS DOS EMPREENDIMENTOS'!#REF!,CD80*(1-'DADOS DOS EMPREENDIMENTOS'!#REF!-'DADOS DOS EMPREENDIMENTOS'!#REF!))))","v":{"$error":"#REF!"}}]
[null,null,null,null,null,null,null,null,null,null,null,null,null,null,35,null,null,null,null,35,null,null,null,null,35,null,null,null,null,35,"2012-04-01",0,{"$f":"IF(AD81<'DADOS DOS EMPREENDIMENTOS'!AF$11,0,IF(AD81='DADOS DOS EMPREENDIMENTOS'!AF$11,SUM(AF$46:AF81)*(1-'DADOS DOS EMPREENDIMENTOS'!#REF!-'DADOS DOS EMPREENDIMENTOS'!#REF!)+'DADOS DOS EMPREENDIMENTOS'!#REF!,IF(AD81='DADOS DOS EMPREENDIMENTOS'!#REF!,'DADOS DOS EMPREENDIMENTOS'!#REF!,AF81*(1-'DADOS DOS EMPREENDIMENTOS'!#REF!-'DADOS DOS EMPREENDIMENTOS'!#REF!))))","v":{"$error":"#REF!"}},null,35,"2012-04-01",0,{"$f":"IF(AI81<'DADOS DOS EMPREENDIMENTOS'!AK$11,0,IF(AI81='DADOS DOS EMPREENDIMENTOS'!AK$11,SUM(AK$46:AK81)*(1-'DADOS DOS EMPREENDIMENTOS'!#REF!-'DADOS DOS EMPREENDIMENTOS'!#REF!)+'DADOS DOS EMPREENDIMENTOS'!#REF!,IF(AI81='DADOS DOS EMPREENDIMENTOS'!#REF!,'DADOS DOS EMPREENDIMENTOS'!#REF!,AK81*(1-'DADOS DOS EMPREENDIMENTOS'!#REF!-'DADOS DOS EMPREENDIMENTOS'!#REF!))))","v":{"$error":"#REF!"}},null,35,"2012-04-01",0,{"$f":"IF(AN81<'DADOS DOS EMPREENDIMENTOS'!AP$11,0,IF(AN81='DADOS DOS EMPREENDIMENTOS'!AP$11,SUM(AP$46:AP81)*(1-'DADOS DOS EMPREENDIMENTOS'!#REF!-'DADOS DOS EMPREENDIMENTOS'!#REF!)+'DADOS DOS EMPREENDIMENTOS'!#REF!,IF(AN81='DADOS DOS EMPREENDIMENTOS'!#REF!,'DADOS DOS EMPREENDIMENTOS'!#REF!,AP81*(1-'DADOS DOS EMPREENDIMENTOS'!#REF!-'DADOS DOS EMPREENDIMENTOS'!#REF!))))","v":{"$error":"#REF!"}},null,35,"2012-04-01",0,{"$f":"IF(AS81<'DADOS DOS EMPREENDIMENTOS'!AU$11,0,IF(AS81='DADOS DOS EMPREENDIMENTOS'!AU$11,SUM(AU$46:AU81)*(1-'DADOS DOS EMPREENDIMENTOS'!#REF!-'DADOS DOS EMPREENDIMENTOS'!#REF!)+'DADOS DOS EMPREENDIMENTOS'!#REF!,IF(AS81='DADOS DOS EMPREENDIMENTOS'!#REF!,'DADOS DOS EMPREENDIMENTOS'!#REF!,AU81*(1-'DADOS DOS EMPREENDIMENTOS'!#REF!-'DADOS DOS EMPREENDIMENTOS'!#REF!))))","v":{"$error":"#REF!"}},null,35,"2012-04-01",0,{"$f":"IF(AX81<'DADOS DOS EMPREENDIMENTOS'!AZ$11,0,IF(AX81='DADOS DOS EMPREENDIMENTOS'!AZ$11,SUM(AZ$46:AZ81)*(1-'DADOS DOS EMPREENDIMENTOS'!#REF!-'DADOS DOS EMPREENDIMENTOS'!#REF!)+'DADOS DOS EMPREENDIMENTOS'!#REF!,IF(AX81='DADOS DOS EMPREENDIMENTOS'!#REF!,'DADOS DOS EMPREENDIMENTOS'!#REF!,AZ81*(1-'DADOS DOS EMPREENDIMENTOS'!#REF!-'DADOS DOS EMPREENDIMENTOS'!#REF!))))","v":{"$error":"#REF!"}},null,35,"2012-04-01",0,{"$f":"IF(BC81<'DADOS DOS EMPREENDIMENTOS'!BE$11,0,IF(BC81='DADOS DOS EMPREENDIMENTOS'!BE$11,SUM(BE$46:BE81)*(1-'DADOS DOS EMPREENDIMENTOS'!#REF!-'DADOS DOS EMPREENDIMENTOS'!#REF!)+'DADOS DOS EMPREENDIMENTOS'!#REF!,IF(BC81='DADOS DOS EMPREENDIMENTOS'!#REF!,'DADOS DOS EMPREENDIMENTOS'!#REF!,BE81*(1-'DADOS DOS EMPREENDIMENTOS'!#REF!-'DADOS DOS EMPREENDIMENTOS'!#REF!))))","v":{"$error":"#REF!"}},null,35,"2012-04-01",0,{"$f":"IF(BH81<'DADOS DOS EMPREENDIMENTOS'!BJ$11,0,IF(BH81='DADOS DOS EMPREENDIMENTOS'!BJ$11,SUM(BJ$46:BJ81)*(1-'DADOS DOS EMPREENDIMENTOS'!#REF!-'DADOS DOS EMPREENDIMENTOS'!#REF!)+'DADOS DOS EMPREENDIMENTOS'!#REF!,IF(BH81='DADOS DOS EMPREENDIMENTOS'!#REF!,'DADOS DOS EMPREENDIMENTOS'!#REF!,BJ81*(1-'DADOS DOS EMPREENDIMENTOS'!#REF!-'DADOS DOS EMPREENDIMENTOS'!#REF!))))","v":{"$error":"#REF!"}},null,35,"2012-04-01",0,{"$f":"IF(BM81<'DADOS DOS EMPREENDIMENTOS'!BO$11,0,IF(BM81='DADOS DOS EMPREENDIMENTOS'!BO$11,SUM(BO$46:BO81)*(1-'DADOS DOS EMPREENDIMENTOS'!#REF!-'DADOS DOS EMPREENDIMENTOS'!#REF!)+'DADOS DOS EMPREENDIMENTOS'!#REF!,IF(BM81='DADOS DOS EMPREENDIMENTOS'!BO$12,'DADOS DOS EMPREENDIMENTOS'!#REF!,BO81*(1-'DADOS DOS EMPREENDIMENTOS'!#REF!-'DADOS DOS EMPREENDIMENTOS'!#REF!))))","v":{"$error":"#REF!"}},null,35,"2012-04-01",0,{"$f":"IF(BR81<'DADOS DOS EMPREENDIMENTOS'!BT$11,0,IF(BR81='DADOS DOS EMPREENDIMENTOS'!BT$11,SUM(BT$46:BT81)*(1-'DADOS DOS EMPREENDIMENTOS'!#REF!-'DADOS DOS EMPREENDIMENTOS'!#REF!)+'DADOS DOS EMPREENDIMENTOS'!#REF!,IF(BR81='DADOS DOS EMPREENDIMENTOS'!BT$12,'DADOS DOS EMPREENDIMENTOS'!#REF!,BT81*(1-'DADOS DOS EMPREENDIMENTOS'!#REF!-'DADOS DOS EMPREENDIMENTOS'!#REF!))))","v":{"$error":"#REF!"}},null,35,"2012-04-01",0,{"$f":"IF(BW81<'DADOS DOS EMPREENDIMENTOS'!BY$11,0,IF(BW81='DADOS DOS EMPREENDIMENTOS'!BY$11,SUM(BY$46:BY81)*(1-'DADOS DOS EMPREENDIMENTOS'!#REF!-'DADOS DOS EMPREENDIMENTOS'!#REF!)+'DADOS DOS EMPREENDIMENTOS'!#REF!,IF(BW81='DADOS DOS EMPREENDIMENTOS'!BY$12,'DADOS DOS EMPREENDIMENTOS'!#REF!,BY81*(1-'DADOS DOS EMPREENDIMENTOS'!#REF!-'DADOS DOS EMPREENDIMENTOS'!#REF!))))","v":{"$error":"#REF!"}},null,35,"2012-04-01",0,{"$f":"IF(CB81<'DADOS DOS EMPREENDIMENTOS'!CD$11,0,IF(CB81='DADOS DOS EMPREENDIMENTOS'!CD$11,SUM(CD$46:CD81)*(1-'DADOS DOS EMPREENDIMENTOS'!#REF!-'DADOS DOS EMPREENDIMENTOS'!#REF!)+'DADOS DOS EMPREENDIMENTOS'!#REF!,IF(CB81='DADOS DOS EMPREENDIMENTOS'!CD$12,'DADOS DOS EMPREENDIMENTOS'!#REF!,CD81*(1-'DADOS DOS EMPREENDIMENTOS'!#REF!-'DADOS DOS EMPREENDIMENTOS'!#REF!))))","v":{"$error":"#REF!"}}]
[null,null,null,null,null,null,null,null,null,null,null,null,null,null,36,null,null,null,null,36,null,null,null,null,36,null,null,null,null,36,"2012-05-01",0,{"$f":"IF(AD82<'DADOS DOS EMPREENDIMENTOS'!AF$11,0,IF(AD82='DADOS DOS EMPREENDIMENTOS'!AF$11,SUM(AF$46:AF82)*(1-'DADOS DOS EMPREENDIMENTOS'!#REF!-'DADOS DOS EMPREENDIMENTOS'!#REF!)+'DADOS DOS EMPREENDIMENTOS'!#REF!,IF(AD82='DADOS DOS EMPREENDIMENTOS'!#REF!,'DADOS DOS EMPREENDIMENTOS'!#REF!,AF82*(1-'DADOS DOS EMPREENDIMENTOS'!#REF!-'DADOS DOS EMPREENDIMENTOS'!#REF!))))","v":{"$error":"#REF!"}},null,36,"2012-05-01",0,{"$f":"IF(AI82<'DADOS DOS EMPREENDIMENTOS'!AK$11,0,IF(AI82='DADOS DOS EMPREENDIMENTOS'!AK$11,SUM(AK$46:AK82)*(1-'DADOS DOS EMPREENDIMENTOS'!#REF!-'DADOS DOS EMPREENDIMENTOS'!#REF!)+'DADOS DOS EMPREENDIMENTOS'!#REF!,IF(AI82='DADOS DOS EMPREENDIMENTOS'!#REF!,'DADOS DOS EMPREENDIMENTOS'!#REF!,AK82*(1-'DADOS DOS EMPREENDIMENTOS'!#REF!-'DADOS DOS EMPREENDIMENTOS'!#REF!))))","v":{"$error":"#REF!"}},null,36,"2012-05-01",0,{"$f":"IF(AN82<'DADOS DOS EMPREENDIMENTOS'!AP$11,0,IF(AN82='DADOS DOS EMPREENDIMENTOS'!AP$11,SUM(AP$46:AP82)*(1-'DADOS DOS EMPREENDIMENTOS'!#REF!-'DADOS DOS EMPREENDIMENTOS'!#REF!)+'DADOS DOS EMPREENDIMENTOS'!#REF!,IF(AN82='DADOS DOS EMPREENDIMENTOS'!#REF!,'DADOS DOS EMPREENDIMENTOS'!#REF!,AP82*(1-'DADOS DOS EMPREENDIMENTOS'!#REF!-'DADOS DOS EMPREENDIMENTOS'!#REF!))))","v":{"$error":"#REF!"}},null,36,"2012-05-01",0,{"$f":"IF(AS82<'DADOS DOS EMPREENDIMENTOS'!AU$11,0,IF(AS82='DADOS DOS EMPREENDIMENTOS'!AU$11,SUM(AU$46:AU82)*(1-'DADOS DOS EMPREENDIMENTOS'!#REF!-'DADOS DOS EMPREENDIMENTOS'!#REF!)+'DADOS DOS EMPREENDIMENTOS'!#REF!,IF(AS82='DADOS DOS EMPREENDIMENTOS'!#REF!,'DADOS DOS EMPREENDIMENTOS'!#REF!,AU82*(1-'DADOS DOS EMPREENDIMENTOS'!#REF!-'DADOS DOS EMPREENDIMENTOS'!#REF!))))","v":{"$error":"#REF!"}},null,36,"2012-05-01",0,{"$f":"IF(AX82<'DADOS DOS EMPREENDIMENTOS'!AZ$11,0,IF(AX82='DADOS DOS EMPREENDIMENTOS'!AZ$11,SUM(AZ$46:AZ82)*(1-'DADOS DOS EMPREENDIMENTOS'!#REF!-'DADOS DOS EMPREENDIMENTOS'!#REF!)+'DADOS DOS EMPREENDIMENTOS'!#REF!,IF(AX82='DADOS DOS EMPREENDIMENTOS'!#REF!,'DADOS DOS EMPREENDIMENTOS'!#REF!,AZ82*(1-'DADOS DOS EMPREENDIMENTOS'!#REF!-'DADOS DOS EMPREENDIMENTOS'!#REF!))))","v":{"$error":"#REF!"}},null,36,"2012-05-01",0,{"$f":"IF(BC82<'DADOS DOS EMPREENDIMENTOS'!BE$11,0,IF(BC82='DADOS DOS EMPREENDIMENTOS'!BE$11,SUM(BE$46:BE82)*(1-'DADOS DOS EMPREENDIMENTOS'!#REF!-'DADOS DOS EMPREENDIMENTOS'!#REF!)+'DADOS DOS EMPREENDIMENTOS'!#REF!,IF(BC82='DADOS DOS EMPREENDIMENTOS'!#REF!,'DADOS DOS EMPREENDIMENTOS'!#REF!,BE82*(1-'DADOS DOS EMPREENDIMENTOS'!#REF!-'DADOS DOS EMPREENDIMENTOS'!#REF!))))","v":{"$error":"#REF!"}},null,36,"2012-05-01",0,{"$f":"IF(BH82<'DADOS DOS EMPREENDIMENTOS'!BJ$11,0,IF(BH82='DADOS DOS EMPREENDIMENTOS'!BJ$11,SUM(BJ$46:BJ82)*(1-'DADOS DOS EMPREENDIMENTOS'!#REF!-'DADOS DOS EMPREENDIMENTOS'!#REF!)+'DADOS DOS EMPREENDIMENTOS'!#REF!,IF(BH82='DADOS DOS EMPREENDIMENTOS'!#REF!,'DADOS DOS EMPREENDIMENTOS'!#REF!,BJ82*(1-'DADOS DOS EMPREENDIMENTOS'!#REF!-'DADOS DOS EMPREENDIMENTOS'!#REF!))))","v":{"$error":"#REF!"}},null,36,"2012-05-01",0,{"$f":"IF(BM82<'DADOS DOS EMPREENDIMENTOS'!BO$11,0,IF(BM82='DADOS DOS EMPREENDIMENTOS'!BO$11,SUM(BO$46:BO82)*(1-'DADOS DOS EMPREENDIMENTOS'!#REF!-'DADOS DOS EMPREENDIMENTOS'!#REF!)+'DADOS DOS EMPREENDIMENTOS'!#REF!,IF(BM82='DADOS DOS EMPREENDIMENTOS'!BO$12,'DADOS DOS EMPREENDIMENTOS'!#REF!,BO82*(1-'DADOS DOS EMPREENDIMENTOS'!#REF!-'DADOS DOS EMPREENDIMENTOS'!#REF!))))","v":{"$error":"#REF!"}},null,36,"2012-05-01",0,{"$f":"IF(BR82<'DADOS DOS EMPREENDIMENTOS'!BT$11,0,IF(BR82='DADOS DOS EMPREENDIMENTOS'!BT$11,SUM(BT$46:BT82)*(1-'DADOS DOS EMPREENDIMENTOS'!#REF!-'DADOS DOS EMPREENDIMENTOS'!#REF!)+'DADOS DOS EMPREENDIMENTOS'!#REF!,IF(BR82='DADOS DOS EMPREENDIMENTOS'!BT$12,'DADOS DOS EMPREENDIMENTOS'!#REF!,BT82*(1-'DADOS DOS EMPREENDIMENTOS'!#REF!-'DADOS DOS EMPREENDIMENTOS'!#REF!))))","v":{"$error":"#REF!"}},null,36,"2012-05-01",0,{"$f":"IF(BW82<'DADOS DOS EMPREENDIMENTOS'!BY$11,0,IF(BW82='DADOS DOS EMPREENDIMENTOS'!BY$11,SUM(BY$46:BY82)*(1-'DADOS DOS EMPREENDIMENTOS'!#REF!-'DADOS DOS EMPREENDIMENTOS'!#REF!)+'DADOS DOS EMPREENDIMENTOS'!#REF!,IF(BW82='DADOS DOS EMPREENDIMENTOS'!BY$12,'DADOS DOS EMPREENDIMENTOS'!#REF!,BY82*(1-'DADOS DOS EMPREENDIMENTOS'!#REF!-'DADOS DOS EMPREENDIMENTOS'!#REF!))))","v":{"$error":"#REF!"}},null,36,"2012-05-01",0,{"$f":"IF(CB82<'DADOS DOS EMPREENDIMENTOS'!CD$11,0,IF(CB82='DADOS DOS EMPREENDIMENTOS'!CD$11,SUM(CD$46:CD82)*(1-'DADOS DOS EMPREENDIMENTOS'!#REF!-'DADOS DOS EMPREENDIMENTOS'!#REF!)+'DADOS DOS EMPREENDIMENTOS'!#REF!,IF(CB82='DADOS DOS EMPREENDIMENTOS'!CD$12,'DADOS DOS EMPREENDIMENTOS'!#REF!,CD82*(1-'DADOS DOS EMPREENDIMENTOS'!#REF!-'DADOS DOS EMPREENDIMENTOS'!#REF!))))","v":{"$error":"#REF!"}}]
[null,null,null,null,null,null,null,null,null,null,null,null,null,null,37,null,null,null,null,37,null,null,null,null,37,null,null,null,null,37,"2012-06-01",0,{"$f":"IF(AD83<'DADOS DOS EMPREENDIMENTOS'!AF$11,0,IF(AD83='DADOS DOS EMPREENDIMENTOS'!AF$11,SUM(AF$46:AF83)*(1-'DADOS DOS EMPREENDIMENTOS'!#REF!-'DADOS DOS EMPREENDIMENTOS'!#REF!)+'DADOS DOS EMPREENDIMENTOS'!#REF!,IF(AD83='DADOS DOS EMPREENDIMENTOS'!#REF!,'DADOS DOS EMPREENDIMENTOS'!#REF!,AF83*(1-'DADOS DOS EMPREENDIMENTOS'!#REF!-'DADOS DOS EMPREENDIMENTOS'!#REF!))))","v":{"$error":"#REF!"}},null,37,"2012-06-01",0,{"$f":"IF(AI83<'DADOS DOS EMPREENDIMENTOS'!AK$11,0,IF(AI83='DADOS DOS EMPREENDIMENTOS'!AK$11,SUM(AK$46:AK83)*(1-'DADOS DOS EMPREENDIMENTOS'!#REF!-'DADOS DOS EMPREENDIMENTOS'!#REF!)+'DADOS DOS EMPREENDIMENTOS'!#REF!,IF(AI83='DADOS DOS EMPREENDIMENTOS'!#REF!,'DADOS DOS EMPREENDIMENTOS'!#REF!,AK83*(1-'DADOS DOS EMPREENDIMENTOS'!#REF!-'DADOS DOS EMPREENDIMENTOS'!#REF!))))","v":{"$error":"#REF!"}},null,37,"2012-06-01",0,{"$f":"IF(AN83<'DADOS DOS EMPREENDIMENTOS'!AP$11,0,IF(AN83='DADOS DOS EMPREENDIMENTOS'!AP$11,SUM(AP$46:AP83)*(1-'DADOS DOS EMPREENDIMENTOS'!#REF!-'DADOS DOS EMPREENDIMENTOS'!#REF!)+'DADOS DOS EMPREENDIMENTOS'!#REF!,IF(AN83='DADOS DOS EMPREENDIMENTOS'!#REF!,'DADOS DOS EMPREENDIMENTOS'!#REF!,AP83*(1-'DADOS DOS EMPREENDIMENTOS'!#REF!-'DADOS DOS EMPREENDIMENTOS'!#REF!))))","v":{"$error":"#REF!"}},null,37,"2012-06-01",0,{"$f":"IF(AS83<'DADOS DOS EMPREENDIMENTOS'!AU$11,0,IF(AS83='DADOS DOS EMPREENDIMENTOS'!AU$11,SUM(AU$46:AU83)*(1-'DADOS DOS EMPREENDIMENTOS'!#REF!-'DADOS DOS EMPREENDIMENTOS'!#REF!)+'DADOS DOS EMPREENDIMENTOS'!#REF!,IF(AS83='DADOS DOS EMPREENDIMENTOS'!#REF!,'DADOS DOS EMPREENDIMENTOS'!#REF!,AU83*(1-'DADOS DOS EMPREENDIMENTOS'!#REF!-'DADOS DOS EMPREENDIMENTOS'!#REF!))))","v":{"$error":"#REF!"}},null,37,"2012-06-01",0,{"$f":"IF(AX83<'DADOS DOS EMPREENDIMENTOS'!AZ$11,0,IF(AX83='DADOS DOS EMPREENDIMENTOS'!AZ$11,SUM(AZ$46:AZ83)*(1-'DADOS DOS EMPREENDIMENTOS'!#REF!-'DADOS DOS EMPREENDIMENTOS'!#REF!)+'DADOS DOS EMPREENDIMENTOS'!#REF!,IF(AX83='DADOS DOS EMPREENDIMENTOS'!#REF!,'DADOS DOS EMPREENDIMENTOS'!#REF!,AZ83*(1-'DADOS DOS EMPREENDIMENTOS'!#REF!-'DADOS DOS EMPREENDIMENTOS'!#REF!))))","v":{"$error":"#REF!"}},null,37,"2012-06-01",0,{"$f":"IF(BC83<'DADOS DOS EMPREENDIMENTOS'!BE$11,0,IF(BC83='DADOS DOS EMPREENDIMENTOS'!BE$11,SUM(BE$46:BE83)*(1-'DADOS DOS EMPREENDIMENTOS'!#REF!-'DADOS DOS EMPREENDIMENTOS'!#REF!)+'DADOS DOS EMPREENDIMENTOS'!#REF!,IF(BC83='DADOS DOS EMPREENDIMENTOS'!#REF!,'DADOS DOS EMPREENDIMENTOS'!#REF!,BE83*(1-'DADOS DOS EMPREENDIMENTOS'!#REF!-'DADOS DOS EMPREENDIMENTOS'!#REF!))))","v":{"$error":"#REF!"}},null,37,"2012-06-01",0,{"$f":"IF(BH83<'DADOS DOS EMPREENDIMENTOS'!BJ$11,0,IF(BH83='DADOS DOS EMPREENDIMENTOS'!BJ$11,SUM(BJ$46:BJ83)*(1-'DADOS DOS EMPREENDIMENTOS'!#REF!-'DADOS DOS EMPREENDIMENTOS'!#REF!)+'DADOS DOS EMPREENDIMENTOS'!#REF!,IF(BH83='DADOS DOS EMPREENDIMENTOS'!#REF!,'DADOS DOS EMPREENDIMENTOS'!#REF!,BJ83*(1-'DADOS DOS EMPREENDIMENTOS'!#REF!-'DADOS DOS EMPREENDIMENTOS'!#REF!))))","v":{"$error":"#REF!"}},null,37,"2012-06-01",0,{"$f":"IF(BM83<'DADOS DOS EMPREENDIMENTOS'!BO$11,0,IF(BM83='DADOS DOS EMPREENDIMENTOS'!BO$11,SUM(BO$46:BO83)*(1-'DADOS DOS EMPREENDIMENTOS'!#REF!-'DADOS DOS EMPREENDIMENTOS'!#REF!)+'DADOS DOS EMPREENDIMENTOS'!#REF!,IF(BM83='DADOS DOS EMPREENDIMENTOS'!BO$12,'DADOS DOS EMPREENDIMENTOS'!#REF!,BO83*(1-'DADOS DOS EMPREENDIMENTOS'!#REF!-'DADOS DOS EMPREENDIMENTOS'!#REF!))))","v":{"$error":"#REF!"}},null,37,"2012-06-01",0,{"$f":"IF(BR83<'DADOS DOS EMPREENDIMENTOS'!BT$11,0,IF(BR83='DADOS DOS EMPREENDIMENTOS'!BT$11,SUM(BT$46:BT83)*(1-'DADOS DOS EMPREENDIMENTOS'!#REF!-'DADOS DOS EMPREENDIMENTOS'!#REF!)+'DADOS DOS EMPREENDIMENTOS'!#REF!,IF(BR83='DADOS DOS EMPREENDIMENTOS'!BT$12,'DADOS DOS EMPREENDIMENTOS'!#REF!,BT83*(1-'DADOS DOS EMPREENDIMENTOS'!#REF!-'DADOS DOS EMPREENDIMENTOS'!#REF!))))","v":{"$error":"#REF!"}},null,37,"2012-06-01",0,{"$f":"IF(BW83<'DADOS DOS EMPREENDIMENTOS'!BY$11,0,IF(BW83='DADOS DOS EMPREENDIMENTOS'!BY$11,SUM(BY$46:BY83)*(1-'DADOS DOS EMPREENDIMENTOS'!#REF!-'DADOS DOS EMPREENDIMENTOS'!#REF!)+'DADOS DOS EMPREENDIMENTOS'!#REF!,IF(BW83='DADOS DOS EMPREENDIMENTOS'!BY$12,'DADOS DOS EMPREENDIMENTOS'!#REF!,BY83*(1-'DADOS DOS EMPREENDIMENTOS'!#REF!-'DADOS DOS EMPREENDIMENTOS'!#REF!))))","v":{"$error":"#REF!"}},null,37,"2012-06-01",0,{"$f":"IF(CB83<'DADOS DOS EMPREENDIMENTOS'!CD$11,0,IF(CB83='DADOS DOS EMPREENDIMENTOS'!CD$11,SUM(CD$46:CD83)*(1-'DADOS DOS EMPREENDIMENTOS'!#REF!-'DADOS DOS EMPREENDIMENTOS'!#REF!)+'DADOS DOS EMPREENDIMENTOS'!#REF!,IF(CB83='DADOS DOS EMPREENDIMENTOS'!CD$12,'DADOS DOS EMPREENDIMENTOS'!#REF!,CD83*(1-'DADOS DOS EMPREENDIMENTOS'!#REF!-'DADOS DOS EMPREENDIMENTOS'!#REF!))))","v":{"$error":"#REF!"}}]
[null,null,null,null,null,null,null,null,null,null,null,null,null,null,38,null,null,null,null,38,null,null,null,null,38,null,null,null,null,38,"2012-07-01",0,{"$f":"IF(AD84<'DADOS DOS EMPREENDIMENTOS'!AF$11,0,IF(AD84='DADOS DOS EMPREENDIMENTOS'!AF$11,SUM(AF$46:AF84)*(1-'DADOS DOS EMPREENDIMENTOS'!#REF!-'DADOS DOS EMPREENDIMENTOS'!#REF!)+'DADOS DOS EMPREENDIMENTOS'!#REF!,IF(AD84='DADOS DOS EMPREENDIMENTOS'!#REF!,'DADOS DOS EMPREENDIMENTOS'!#REF!,AF84*(1-'DADOS DOS EMPREENDIMENTOS'!#REF!-'DADOS DOS EMPREENDIMENTOS'!#REF!))))","v":{"$error":"#REF!"}},null,38,"2012-07-01",0,{"$f":"IF(AI84<'DADOS DOS EMPREENDIMENTOS'!AK$11,0,IF(AI84='DADOS DOS EMPREENDIMENTOS'!AK$11,SUM(AK$46:AK84)*(1-'DADOS DOS EMPREENDIMENTOS'!#REF!-'DADOS DOS EMPREENDIMENTOS'!#REF!)+'DADOS DOS EMPREENDIMENTOS'!#REF!,IF(AI84='DADOS DOS EMPREENDIMENTOS'!#REF!,'DADOS DOS EMPREENDIMENTOS'!#REF!,AK84*(1-'DADOS DOS EMPREENDIMENTOS'!#REF!-'DADOS DOS EMPREENDIMENTOS'!#REF!))))","v":{"$error":"#REF!"}},null,38,"2012-07-01",0,{"$f":"IF(AN84<'DADOS DOS EMPREENDIMENTOS'!AP$11,0,IF(AN84='DADOS DOS EMPREENDIMENTOS'!AP$11,SUM(AP$46:AP84)*(1-'DADOS DOS EMPREENDIMENTOS'!#REF!-'DADOS DOS EMPREENDIMENTOS'!#REF!)+'DADOS DOS EMPREENDIMENTOS'!#REF!,IF(AN84='DADOS DOS EMPREENDIMENTOS'!#REF!,'DADOS DOS EMPREENDIMENTOS'!#REF!,AP84*(1-'DADOS DOS EMPREENDIMENTOS'!#REF!-'DADOS DOS EMPREENDIMENTOS'!#REF!))))","v":{"$error":"#REF!"}},null,38,"2012-07-01",0,{"$f":"IF(AS84<'DADOS DOS EMPREENDIMENTOS'!AU$11,0,IF(AS84='DADOS DOS EMPREENDIMENTOS'!AU$11,SUM(AU$46:AU84)*(1-'DADOS DOS EMPREENDIMENTOS'!#REF!-'DADOS DOS EMPREENDIMENTOS'!#REF!)+'DADOS DOS EMPREENDIMENTOS'!#REF!,IF(AS84='DADOS DOS EMPREENDIMENTOS'!#REF!,'DADOS DOS EMPREENDIMENTOS'!#REF!,AU84*(1-'DADOS DOS EMPREENDIMENTOS'!#REF!-'DADOS DOS EMPREENDIMENTOS'!#REF!))))","v":{"$error":"#REF!"}},null,38,"2012-07-01",0,{"$f":"IF(AX84<'DADOS DOS EMPREENDIMENTOS'!AZ$11,0,IF(AX84='DADOS DOS EMPREENDIMENTOS'!AZ$11,SUM(AZ$46:AZ84)*(1-'DADOS DOS EMPREENDIMENTOS'!#REF!-'DADOS DOS EMPREENDIMENTOS'!#REF!)+'DADOS DOS EMPREENDIMENTOS'!#REF!,IF(AX84='DADOS DOS EMPREENDIMENTOS'!#REF!,'DADOS DOS EMPREENDIMENTOS'!#REF!,AZ84*(1-'DADOS DOS EMPREENDIMENTOS'!#REF!-'DADOS DOS EMPREENDIMENTOS'!#REF!))))","v":{"$error":"#REF!"}},null,38,"2012-07-01",0,{"$f":"IF(BC84<'DADOS DOS EMPREENDIMENTOS'!BE$11,0,IF(BC84='DADOS DOS EMPREENDIMENTOS'!BE$11,SUM(BE$46:BE84)*(1-'DADOS DOS EMPREENDIMENTOS'!#REF!-'DADOS DOS EMPREENDIMENTOS'!#REF!)+'DADOS DOS EMPREENDIMENTOS'!#REF!,IF(BC84='DADOS DOS EMPREENDIMENTOS'!#REF!,'DADOS DOS EMPREENDIMENTOS'!#REF!,BE84*(1-'DADOS DOS EMPREENDIMENTOS'!#REF!-'DADOS DOS EMPREENDIMENTOS'!#REF!))))","v":{"$error":"#REF!"}},null,38,"2012-07-01",0,{"$f":"IF(BH84<'DADOS DOS EMPREENDIMENTOS'!BJ$11,0,IF(BH84='DADOS DOS EMPREENDIMENTOS'!BJ$11,SUM(BJ$46:BJ84)*(1-'DADOS DOS EMPREENDIMENTOS'!#REF!-'DADOS DOS EMPREENDIMENTOS'!#REF!)+'DADOS DOS EMPREENDIMENTOS'!#REF!,IF(BH84='DADOS DOS EMPREENDIMENTOS'!#REF!,'DADOS DOS EMPREENDIMENTOS'!#REF!,BJ84*(1-'DADOS DOS EMPREENDIMENTOS'!#REF!-'DADOS DOS EMPREENDIMENTOS'!#REF!))))","v":{"$error":"#REF!"}},null,38,"2012-07-01",0,{"$f":"IF(BM84<'DADOS DOS EMPREENDIMENTOS'!BO$11,0,IF(BM84='DADOS DOS EMPREENDIMENTOS'!BO$11,SUM(BO$46:BO84)*(1-'DADOS DOS EMPREENDIMENTOS'!#REF!-'DADOS DOS EMPREENDIMENTOS'!#REF!)+'DADOS DOS EMPREENDIMENTOS'!#REF!,IF(BM84='DADOS DOS EMPREENDIMENTOS'!BO$12,'DADOS DOS EMPREENDIMENTOS'!#REF!,BO84*(1-'DADOS DOS EMPREENDIMENTOS'!#REF!-'DADOS DOS EMPREENDIMENTOS'!#REF!))))","v":{"$error":"#REF!"}},null,38,"2012-07-01",0,{"$f":"IF(BR84<'DADOS DOS EMPREENDIMENTOS'!BT$11,0,IF(BR84='DADOS DOS EMPREENDIMENTOS'!BT$11,SUM(BT$46:BT84)*(1-'DADOS DOS EMPREENDIMENTOS'!#REF!-'DADOS DOS EMPREENDIMENTOS'!#REF!)+'DADOS DOS EMPREENDIMENTOS'!#REF!,IF(BR84='DADOS DOS EMPREENDIMENTOS'!BT$12,'DADOS DOS EMPREENDIMENTOS'!#REF!,BT84*(1-'DADOS DOS EMPREENDIMENTOS'!#REF!-'DADOS DOS EMPREENDIMENTOS'!#REF!))))","v":{"$error":"#REF!"}},null,38,"2012-07-01",0,{"$f":"IF(BW84<'DADOS DOS EMPREENDIMENTOS'!BY$11,0,IF(BW84='DADOS DOS EMPREENDIMENTOS'!BY$11,SUM(BY$46:BY84)*(1-'DADOS DOS EMPREENDIMENTOS'!#REF!-'DADOS DOS EMPREENDIMENTOS'!#REF!)+'DADOS DOS EMPREENDIMENTOS'!#REF!,IF(BW84='DADOS DOS EMPREENDIMENTOS'!BY$12,'DADOS DOS EMPREENDIMENTOS'!#REF!,BY84*(1-'DADOS DOS EMPREENDIMENTOS'!#REF!-'DADOS DOS EMPREENDIMENTOS'!#REF!))))","v":{"$error":"#REF!"}},null,38,"2012-07-01",0,{"$f":"IF(CB84<'DADOS DOS EMPREENDIMENTOS'!CD$11,0,IF(CB84='DADOS DOS EMPREENDIMENTOS'!CD$11,SUM(CD$46:CD84)*(1-'DADOS DOS EMPREENDIMENTOS'!#REF!-'DADOS DOS EMPREENDIMENTOS'!#REF!)+'DADOS DOS EMPREENDIMENTOS'!#REF!,IF(CB84='DADOS DOS EMPREENDIMENTOS'!CD$12,'DADOS DOS EMPREENDIMENTOS'!#REF!,CD84*(1-'DADOS DOS EMPREENDIMENTOS'!#REF!-'DADOS DOS EMPREENDIMENTOS'!#REF!))))","v":{"$error":"#REF!"}}]
[null,null,null,null,null,null,null,null,null,null,null,null,null,null,39,null,null,null,null,39,null,null,null,null,39,null,null,null,null,39,"2012-08-01",0,{"$f":"IF(AD85<'DADOS DOS EMPREENDIMENTOS'!AF$11,0,IF(AD85='DADOS DOS EMPREENDIMENTOS'!AF$11,SUM(AF$46:AF85)*(1-'DADOS DOS EMPREENDIMENTOS'!#REF!-'DADOS DOS EMPREENDIMENTOS'!#REF!)+'DADOS DOS EMPREENDIMENTOS'!#REF!,IF(AD85='DADOS DOS EMPREENDIMENTOS'!#REF!,'DADOS DOS EMPREENDIMENTOS'!#REF!,AF85*(1-'DADOS DOS EMPREENDIMENTOS'!#REF!-'DADOS DOS EMPREENDIMENTOS'!#REF!))))","v":{"$error":"#REF!"}},null,39,"2012-08-01",0,{"$f":"IF(AI85<'DADOS DOS EMPREENDIMENTOS'!AK$11,0,IF(AI85='DADOS DOS EMPREENDIMENTOS'!AK$11,SUM(AK$46:AK85)*(1-'DADOS DOS EMPREENDIMENTOS'!#REF!-'DADOS DOS EMPREENDIMENTOS'!#REF!)+'DADOS DOS EMPREENDIMENTOS'!#REF!,IF(AI85='DADOS DOS EMPREENDIMENTOS'!#REF!,'DADOS DOS EMPREENDIMENTOS'!#REF!,AK85*(1-'DADOS DOS EMPREENDIMENTOS'!#REF!-'DADOS DOS EMPREENDIMENTOS'!#REF!))))","v":{"$error":"#REF!"}},null,39,"2012-08-01",0,{"$f":"IF(AN85<'DADOS DOS EMPREENDIMENTOS'!AP$11,0,IF(AN85='DADOS DOS EMPREENDIMENTOS'!AP$11,SUM(AP$46:AP85)*(1-'DADOS DOS EMPREENDIMENTOS'!#REF!-'DADOS DOS EMPREENDIMENTOS'!#REF!)+'DADOS DOS EMPREENDIMENTOS'!#REF!,IF(AN85='DADOS DOS EMPREENDIMENTOS'!#REF!,'DADOS DOS EMPREENDIMENTOS'!#REF!,AP85*(1-'DADOS DOS EMPREENDIMENTOS'!#REF!-'DADOS DOS EMPREENDIMENTOS'!#REF!))))","v":{"$error":"#REF!"}},null,39,"2012-08-01",0,{"$f":"IF(AS85<'DADOS DOS EMPREENDIMENTOS'!AU$11,0,IF(AS85='DADOS DOS EMPREENDIMENTOS'!AU$11,SUM(AU$46:AU85)*(1-'DADOS DOS EMPREENDIMENTOS'!#REF!-'DADOS DOS EMPREENDIMENTOS'!#REF!)+'DADOS DOS EMPREENDIMENTOS'!#REF!,IF(AS85='DADOS DOS EMPREENDIMENTOS'!#REF!,'DADOS DOS EMPREENDIMENTOS'!#REF!,AU85*(1-'DADOS DOS EMPREENDIMENTOS'!#REF!-'DADOS DOS EMPREENDIMENTOS'!#REF!))))","v":{"$error":"#REF!"}},null,39,"2012-08-01",0,{"$f":"IF(AX85<'DADOS DOS EMPREENDIMENTOS'!AZ$11,0,IF(AX85='DADOS DOS EMPREENDIMENTOS'!AZ$11,SUM(AZ$46:AZ85)*(1-'DADOS DOS EMPREENDIMENTOS'!#REF!-'DADOS DOS EMPREENDIMENTOS'!#REF!)+'DADOS DOS EMPREENDIMENTOS'!#REF!,IF(AX85='DADOS DOS EMPREENDIMENTOS'!#REF!,'DADOS DOS EMPREENDIMENTOS'!#REF!,AZ85*(1-'DADOS DOS EMPREENDIMENTOS'!#REF!-'DADOS DOS EMPREENDIMENTOS'!#REF!))))","v":{"$error":"#REF!"}},null,39,"2012-08-01",0,{"$f":"IF(BC85<'DADOS DOS EMPREENDIMENTOS'!BE$11,0,IF(BC85='DADOS DOS EMPREENDIMENTOS'!BE$11,SUM(BE$46:BE85)*(1-'DADOS DOS EMPREENDIMENTOS'!#REF!-'DADOS DOS EMPREENDIMENTOS'!#REF!)+'DADOS DOS EMPREENDIMENTOS'!#REF!,IF(BC85='DADOS DOS EMPREENDIMENTOS'!#REF!,'DADOS DOS EMPREENDIMENTOS'!#REF!,BE85*(1-'DADOS DOS EMPREENDIMENTOS'!#REF!-'DADOS DOS EMPREENDIMENTOS'!#REF!))))","v":{"$error":"#REF!"}},null,39,"2012-08-01",0,{"$f":"IF(BH85<'DADOS DOS EMPREENDIMENTOS'!BJ$11,0,IF(BH85='DADOS DOS EMPREENDIMENTOS'!BJ$11,SUM(BJ$46:BJ85)*(1-'DADOS DOS EMPREENDIMENTOS'!#REF!-'DADOS DOS EMPREENDIMENTOS'!#REF!)+'DADOS DOS EMPREENDIMENTOS'!#REF!,IF(BH85='DADOS DOS EMPREENDIMENTOS'!#REF!,'DADOS DOS EMPREENDIMENTOS'!#REF!,BJ85*(1-'DADOS DOS EMPREENDIMENTOS'!#REF!-'DADOS DOS EMPREENDIMENTOS'!#REF!))))","v":{"$error":"#REF!"}},null,39,"2012-08-01",0,{"$f":"IF(BM85<'DADOS DOS EMPREENDIMENTOS'!BO$11,0,IF(BM85='DADOS DOS EMPREENDIMENTOS'!BO$11,SUM(BO$46:BO85)*(1-'DADOS DOS EMPREENDIMENTOS'!#REF!-'DADOS DOS EMPREENDIMENTOS'!#REF!)+'DADOS DOS EMPREENDIMENTOS'!#REF!,IF(BM85='DADOS DOS EMPREENDIMENTOS'!BO$12,'DADOS DOS EMPREENDIMENTOS'!#REF!,BO85*(1-'DADOS DOS EMPREENDIMENTOS'!#REF!-'DADOS DOS EMPREENDIMENTOS'!#REF!))))","v":{"$error":"#REF!"}},null,39,"2012-08-01",0,{"$f":"IF(BR85<'DADOS DOS EMPREENDIMENTOS'!BT$11,0,IF(BR85='DADOS DOS EMPREENDIMENTOS'!BT$11,SUM(BT$46:BT85)*(1-'DADOS DOS EMPREENDIMENTOS'!#REF!-'DADOS DOS EMPREENDIMENTOS'!#REF!)+'DADOS DOS EMPREENDIMENTOS'!#REF!,IF(BR85='DADOS DOS EMPREENDIMENTOS'!BT$12,'DADOS DOS EMPREENDIMENTOS'!#REF!,BT85*(1-'DADOS DOS EMPREENDIMENTOS'!#REF!-'DADOS DOS EMPREENDIMENTOS'!#REF!))))","v":{"$error":"#REF!"}},null,39,"2012-08-01",0,{"$f":"IF(BW85<'DADOS DOS EMPREENDIMENTOS'!BY$11,0,IF(BW85='DADOS DOS EMPREENDIMENTOS'!BY$11,SUM(BY$46:BY85)*(1-'DADOS DOS EMPREENDIMENTOS'!#REF!-'DADOS DOS EMPREENDIMENTOS'!#REF!)+'DADOS DOS EMPREENDIMENTOS'!#REF!,IF(BW85='DADOS DOS EMPREENDIMENTOS'!BY$12,'DADOS DOS EMPREENDIMENTOS'!#REF!,BY85*(1-'DADOS DOS EMPREENDIMENTOS'!#REF!-'DADOS DOS EMPREENDIMENTOS'!#REF!))))","v":{"$error":"#REF!"}},null,39,"2012-08-01",0,{"$f":"IF(CB85<'DADOS DOS EMPREENDIMENTOS'!CD$11,0,IF(CB85='DADOS DOS EMPREENDIMENTOS'!CD$11,SUM(CD$46:CD85)*(1-'DADOS DOS EMPREENDIMENTOS'!#REF!-'DADOS DOS EMPREENDIMENTOS'!#REF!)+'DADOS DOS EMPREENDIMENTOS'!#REF!,IF(CB85='DADOS DOS EMPREENDIMENTOS'!CD$12,'DADOS DOS EMPREENDIMENTOS'!#REF!,CD85*(1-'DADOS DOS EMPREENDIMENTOS'!#REF!-'DADOS DOS EMPREENDIMENTOS'!#REF!))))","v":{"$error":"#REF!"}}]
[null,null,null,null,null,null,null,null,null,null,null,null,null,null,40,null,null,null,null,40,null,null,null,null,40,null,null,null,null,40,"2012-09-01",0,{"$f":"IF(AD86<'DADOS DOS EMPREENDIMENTOS'!AF$11,0,IF(AD86='DADOS DOS EMPREENDIMENTOS'!AF$11,SUM(AF$46:AF86)*(1-'DADOS DOS EMPREENDIMENTOS'!#REF!-'DADOS DOS EMPREENDIMENTOS'!#REF!)+'DADOS DOS EMPREENDIMENTOS'!#REF!,IF(AD86='DADOS DOS EMPREENDIMENTOS'!#REF!,'DADOS DOS EMPREENDIMENTOS'!#REF!,AF86*(1-'DADOS DOS EMPREENDIMENTOS'!#REF!-'DADOS DOS EMPREENDIMENTOS'!#REF!))))","v":{"$error":"#REF!"}},null,40,"2012-09-01",0,{"$f":"IF(AI86<'DADOS DOS EMPREENDIMENTOS'!AK$11,0,IF(AI86='DADOS DOS EMPREENDIMENTOS'!AK$11,SUM(AK$46:AK86)*(1-'DADOS DOS EMPREENDIMENTOS'!#REF!-'DADOS DOS EMPREENDIMENTOS'!#REF!)+'DADOS DOS EMPREENDIMENTOS'!#REF!,IF(AI86='DADOS DOS EMPREENDIMENTOS'!#REF!,'DADOS DOS EMPREENDIMENTOS'!#REF!,AK86*(1-'DADOS DOS EMPREENDIMENTOS'!#REF!-'DADOS DOS EMPREENDIMENTOS'!#REF!))))","v":{"$error":"#REF!"}},null,40,"2012-09-01",0,{"$f":"IF(AN86<'DADOS DOS EMPREENDIMENTOS'!AP$11,0,IF(AN86='DADOS DOS EMPREENDIMENTOS'!AP$11,SUM(AP$46:AP86)*(1-'DADOS DOS EMPREENDIMENTOS'!#REF!-'DADOS DOS EMPREENDIMENTOS'!#REF!)+'DADOS DOS EMPREENDIMENTOS'!#REF!,IF(AN86='DADOS DOS EMPREENDIMENTOS'!#REF!,'DADOS DOS EMPREENDIMENTOS'!#REF!,AP86*(1-'DADOS DOS EMPREENDIMENTOS'!#REF!-'DADOS DOS EMPREENDIMENTOS'!#REF!))))","v":{"$error":"#REF!"}},null,40,"2012-09-01",0,{"$f":"IF(AS86<'DADOS DOS EMPREENDIMENTOS'!AU$11,0,IF(AS86='DADOS DOS EMPREENDIMENTOS'!AU$11,SUM(AU$46:AU86)*(1-'DADOS DOS EMPREENDIMENTOS'!#REF!-'DADOS DOS EMPREENDIMENTOS'!#REF!)+'DADOS DOS EMPREENDIMENTOS'!#REF!,IF(AS86='DADOS DOS EMPREENDIMENTOS'!#REF!,'DADOS DOS EMPREENDIMENTOS'!#REF!,AU86*(1-'DADOS DOS EMPREENDIMENTOS'!#REF!-'DADOS DOS EMPREENDIMENTOS'!#REF!))))","v":{"$error":"#REF!"}},null,40,"2012-09-01",0,{"$f":"IF(AX86<'DADOS DOS EMPREENDIMENTOS'!AZ$11,0,IF(AX86='DADOS DOS EMPREENDIMENTOS'!AZ$11,SUM(AZ$46:AZ86)*(1-'DADOS DOS EMPREENDIMENTOS'!#REF!-'DADOS DOS EMPREENDIMENTOS'!#REF!)+'DADOS DOS EMPREENDIMENTOS'!#REF!,IF(AX86='DADOS DOS EMPREENDIMENTOS'!#REF!,'DADOS DOS EMPREENDIMENTOS'!#REF!,AZ86*(1-'DADOS DOS EMPREENDIMENTOS'!#REF!-'DADOS DOS EMPREENDIMENTOS'!#REF!))))","v":{"$error":"#REF!"}},null,40,"2012-09-01",0,{"$f":"IF(BC86<'DADOS DOS EMPREENDIMENTOS'!BE$11,0,IF(BC86='DADOS DOS EMPREENDIMENTOS'!BE$11,SUM(BE$46:BE86)*(1-'DADOS DOS EMPREENDIMENTOS'!#REF!-'DADOS DOS EMPREENDIMENTOS'!#REF!)+'DADOS DOS EMPREENDIMENTOS'!#REF!,IF(BC86='DADOS DOS EMPREENDIMENTOS'!#REF!,'DADOS DOS EMPREENDIMENTOS'!#REF!,BE86*(1-'DADOS DOS EMPREENDIMENTOS'!#REF!-'DADOS DOS EMPREENDIMENTOS'!#REF!))))","v":{"$error":"#REF!"}},null,40,"2012-09-01",0,{"$f":"IF(BH86<'DADOS DOS EMPREENDIMENTOS'!BJ$11,0,IF(BH86='DADOS DOS EMPREENDIMENTOS'!BJ$11,SUM(BJ$46:BJ86)*(1-'DADOS DOS EMPREENDIMENTOS'!#REF!-'DADOS DOS EMPREENDIMENTOS'!#REF!)+'DADOS DOS EMPREENDIMENTOS'!#REF!,IF(BH86='DADOS DOS EMPREENDIMENTOS'!#REF!,'DADOS DOS EMPREENDIMENTOS'!#REF!,BJ86*(1-'DADOS DOS EMPREENDIMENTOS'!#REF!-'DADOS DOS EMPREENDIMENTOS'!#REF!))))","v":{"$error":"#REF!"}},null,40,"2012-09-01",0,{"$f":"IF(BM86<'DADOS DOS EMPREENDIMENTOS'!BO$11,0,IF(BM86='DADOS DOS EMPREENDIMENTOS'!BO$11,SUM(BO$46:BO86)*(1-'DADOS DOS EMPREENDIMENTOS'!#REF!-'DADOS DOS EMPREENDIMENTOS'!#REF!)+'DADOS DOS EMPREENDIMENTOS'!#REF!,IF(BM86='DADOS DOS EMPREENDIMENTOS'!BO$12,'DADOS DOS EMPREENDIMENTOS'!#REF!,BO86*(1-'DADOS DOS EMPREENDIMENTOS'!#REF!-'DADOS DOS EMPREENDIMENTOS'!#REF!))))","v":{"$error":"#REF!"}},null,40,"2012-09-01",0,{"$f":"IF(BR86<'DADOS DOS EMPREENDIMENTOS'!BT$11,0,IF(BR86='DADOS DOS EMPREENDIMENTOS'!BT$11,SUM(BT$46:BT86)*(1-'DADOS DOS EMPREENDIMENTOS'!#REF!-'DADOS DOS EMPREENDIMENTOS'!#REF!)+'DADOS DOS EMPREENDIMENTOS'!#REF!,IF(BR86='DADOS DOS EMPREENDIMENTOS'!BT$12,'DADOS DOS EMPREENDIMENTOS'!#REF!,BT86*(1-'DADOS DOS EMPREENDIMENTOS'!#REF!-'DADOS DOS EMPREENDIMENTOS'!#REF!))))","v":{"$error":"#REF!"}},null,40,"2012-09-01",0,{"$f":"IF(BW86<'DADOS DOS EMPREENDIMENTOS'!BY$11,0,IF(BW86='DADOS DOS EMPREENDIMENTOS'!BY$11,SUM(BY$46:BY86)*(1-'DADOS DOS EMPREENDIMENTOS'!#REF!-'DADOS DOS EMPREENDIMENTOS'!#REF!)+'DADOS DOS EMPREENDIMENTOS'!#REF!,IF(BW86='DADOS DOS EMPREENDIMENTOS'!BY$12,'DADOS DOS EMPREENDIMENTOS'!#REF!,BY86*(1-'DADOS DOS EMPREENDIMENTOS'!#REF!-'DADOS DOS EMPREENDIMENTOS'!#REF!))))","v":{"$error":"#REF!"}},null,40,"2012-09-01",0,{"$f":"IF(CB86<'DADOS DOS EMPREENDIMENTOS'!CD$11,0,IF(CB86='DADOS DOS EMPREENDIMENTOS'!CD$11,SUM(CD$46:CD86)*(1-'DADOS DOS EMPREENDIMENTOS'!#REF!-'DADOS DOS EMPREENDIMENTOS'!#REF!)+'DADOS DOS EMPREENDIMENTOS'!#REF!,IF(CB86='DADOS DOS EMPREENDIMENTOS'!CD$12,'DADOS DOS EMPREENDIMENTOS'!#REF!,CD86*(1-'DADOS DOS EMPREENDIMENTOS'!#REF!-'DADOS DOS EMPREENDIMENTOS'!#REF!))))","v":{"$error":"#REF!"}}]
[]
[]
[]
[]
[]
[]
[]
[]
[]
[]
[]
[]
[]
[]
[]
[]
[]
[]
[]
[]
[]
[]
[]
[]
[]
[]
[]
[]
[]
[]
[]
[]
[]
[]
[]
[]
[]
[]
[]
[]
[]
[]
[]
[]
[]
[]
[]
[]
[]
[]
[]
[]
[]
[]
[]
[]
[]
[]
[]
[]
[]
[]
[]
[]
[]
[]
[]
[]
[]
[]
[]
[]
[]
[]
[]
[]
[]
[]
[]
[]
[]
[]
[]
[]
[]
[]
[]
[]
[]
[]
[]
[]
[]
[]
[]
[]
[null,null,null,null,null,null,null,null,null,null,null,null,null,null,null,null,null,2000]
[]
[]
[]
[]
[]
[]
[]
[]
[]
[]
[]
[]
[]
[null,null,null,null,null,null,null,null,null,null,null,null,null,null,null,null,153000,{"$f":"Q197+4390","v":157390},{"$f":"R197+2000","v":159390}]
[null,null,null,null,null,null,null,null,null,null,null,null,null,null,null,null,155000,{"$f":"Q198+4390","v":159390},{"$f":"R198+2000","v":161390}]
[null,null,null,null,null,null,null,null,null,null,null,null,null,null,null,null,169000,173390,175390]
[null,null,null,null,null,null,null,null,null,null,null,null,null,null,null,null,169000,173390,175390]
[null,null,null,null,null,null,null,null,null,null,null,null,null,null,null,null,170000,174390,176390]
[null,null,null,null,null,null,null,null,null,null,null,null,null,null,null,null,154000,158390,160390]
[null,null,null,null,null,null,null,null,null,null,null,null,null,null,null,null,168000,172390,174390]
[null,null,null,null,null,null,null,null,null,null,null,null,null,null,null,null,158000,162390,164390]
[]
[null,null,null,null,null,null,null,null,null,null,null,null,null,null,null,null,null,1500]

{"sheet":"Avaliações Por Unidades","index":7,"n_rows":73,"n_cols":6,"rows_kept":73,"cut":false,"hidden":false,"merged":[]}
["Tipologia","Qtidade","Descrição","Área privativa m² (col.23)","Valor de VENDA proposto","Valor adotado CAIXA"]
[1,2,"Bl. 06  - 108, 111.\nPCD - Sala, 1 dormit, 1 Banhº, circul., Coz., A Serv., varanda, com 1 vaga.",40.71,"R$ 180.000,00","R$ 169.000,00"]
[2,8,"Bl. 02, 04, 05 e 07  - 110, 113.\nPCD - Sala, 1 dormit, 1 Banhº, circul., Coz., A Serv., varanda, com 1 vaga.",40.71,"R$ 180.000,00","R$ 169.000,00"]
[3,1,"Bl. 06  - 112.\nPCD - Sala, 1 dormit, 1 Banhº, circul., Coz., A Serv., varanda, com 1 vaga.",41.36,"R$ 180.000,00","R$ 171.000,00"]
[4,4,"Bl. 02, 04, 05 e 07  - 114.\nPCD - Sala, 1 dormit, 1 Banhº, circul., Coz., A Serv., varanda, com 1 vaga.",41.36,"R$ 180.000,00","R$ 171.000,00"]
[5,2,"Bl. 06 - 414 e 514.\nSala, 2 dormits, 1 Banhº, circul., Coz., A Serv., varanda, sem vaga.",40.700000000000003,"R$ 170.000,00","R$ 149.000,00"]
[6,11,"Bl. 02 - 516. Bl. 04 - 116, 416 e 516. Bl.s 05 e 07 - 116, 416 e 516.Bl.s 06 -  114.\nSala, 2 dormits, 1 Banhº, circul., Coz., A Serv., varanda, sem vaga.",40.700000000000003,"R$ 170.000,00","R$ 149.000,00"]
[7,6,"Bl. 05 e 07 - 216 e 316 . Bl. 06  - 214 e 314.\nSala, 2 dormits, 1 Banhº, circul., Coz., A Serv., varanda, com 1 vaga.",40.700000000000003,"R$ 190.000,00","R$ 169.000,00"]
[8,6,"Bl. 02 - 116, 216, 316 e 416. Bl. 04 - 216 e 316.\nSala, 2 dormits, 1 Banhº, circul., Coz., A Serv., varanda, com 1 vaga.",40.700000000000003,"R$ 190.000,00","R$ 169.000,00"]
[9,44,"Bl. 02  -  410, 502, 505, 506, 510 e 513. Bl. 04 - 105, 106, 402, 502, 405, 505, 406, 506,\n410, 510, 413 e 513. Bl. 05 e 07  - 102, 402, 502, 405, 505, 406, 506, 410, 510, 413 e\n513. Bl. 06  - 408, 508, 411 e 511.\nSala, 2 dormits, 1 Banhº, circul., Coz., A Serv., varanda, sem vaga.",40.71,"R$ 170.000,00","R$ 149.000,00"]
[10,24,"Bl. 05 e 07  - 202, 302, 205, 305, 206, 306, 210, 310, 213 e 313. Bl. 06 - 208, 308, 211\ne 311.\nSala, 2 dormits, 1 Banhº, circul., Coz., A Serv., varanda, com 1 vaga.",40.71,"R$ 190.000,00","R$ 169.000,00"]
[11,32,"Bl. 02  -  102, 105, 106, 202, 302, 205, 305, 206, 306, 210, 310, 213, 313, 402, 405,\n406 e 413. Bl. 04  - 102, 202, 302, 205, 305, 206, 306, 210, 310, 213 e 313. Bl. 05 e 07 -\n105 e 106.\nSala, 2 dormits, 1 Banhº, circul., Coz., A Serv., varanda, com 1 vaga.",40.71,"R$ 190.000,00","R$ 169.000,00"]
[12,2,"Bl. 01 e 03 - 501.\nSala, 2 dormits, 1 Banhº, circul., Coz., A Serv., varanda, sem vaga.",40.909999999999997,"R$ 170.000,00","R$ 150.000,00"]
[13,3,"Bl. 03  - 201, 301 e 401.\nSala, 2 dormits, 1 Banhº, circul., Coz., A Serv., varanda, com 1 vaga.",40.909999999999997,"R$ 190.000,00","R$ 170.000,00"]
[14,3,"Bl.s 01 - 201, 301 e 401.\nSala, 2 dormits, 1 Banhº, circul., Coz., A Serv., varanda, com 1 vaga.",40.909999999999997,"R$ 190.000,00","R$ 170.000,00"]
[15,1,"Bl. 01 - 101.\nSala, 2 dormits, 1 Banhº, circul., Coz., A Serv., varanda, com 1 vaga.",40.909999999999997,"R$ 190.000,00","R$ 150.000,00"]
[16,9,"Bl. 02 - 515. Bl. 04, 05, 06 e 07  -  415 e 515.\nSala, 2 dormits, 1 Banhº, circul., Coz., A Serv., varanda, sem vaga.",41,"R$ 170.000,00","R$ 150.000,00"]
[17,6,"Bl.s 05 e 07 - 215 e 315. Bl. 06 - 213 e 313\nSala, 2 dormits, 1 Banhº, circul., Coz., A Serv., varanda, com 1 vaga.",41,"R$ 190.000,00","R$ 170.000,00"]
[18,5,"Bl. 02 - 215, 315 e 415. Bl.s 04 - 215 e 315.\nSala, 2 dormits, 1 Banhº, circul., Coz., A Serv., varanda, com 1 vaga.",41,"R$ 190.000,00","R$ 170.000,00"]
[19,12,"Bl. 02 - 409 e 509. Bl. 04 - 109, 409 e 509. Bl.s 05 e 07 - 409 e 509. Bl. 06 - 107, 407 e\n507.\nSala, 2 dormits, 1 Banhº, circul., Coz., A Serv., varanda, sem vaga.",41.01,"R$ 170.000,00","R$ 150.000,00"]
[20,6,"Bl.s 05 e 07 -  209 e 309. Bl. 06 - 207 e 307.\nSala, 2 dormits, 1 Banhº, circul., Coz., A Serv., varanda, com 1 vaga.",41.01,"R$ 190.000,00","R$ 170.000,00"]
[21,7,"Bl. 02 - 109, 209 e 309. Bl. 04 - 209 e 309. Bl.s 05 e 07 - 109.\nSala, 2 dormits, 1 Banhº, circul., Coz., A Serv., varanda, com 1 vaga.",41.01,"R$ 190.000,00","R$ 170.000,00"]
[22,9,"Bl.s 02 - 501. Bl. 04 - 401 e 501. Bl.s 05 e 07 - 101, 401 e 501.\nSala, 2 dormits, 1 Banhº, circul., Coz., A Serv., varanda, sem vaga.",41.05,"R$ 170.000,00","R$ 150.000,00"]
[23,11,"Bl. 02 - 101, 201, 301 e 401. Bl. 04 - 101, 201 e 301. Bl.s 05 e 07 -  201 e 301.\nSala, 2 dormits, 1 Banhº, circul., Coz., A Serv., varanda, com 1 vaga.",41.05,"R$ 190.000,00","R$ 170.000,00"]
[24,11,"Bl.s 01 e 03 - 512.  Bl. 02 - 514. Bl.s 04, 05 e 07 - 414 e 514. Bl. 06 - 412 e 512.\nSala, 2 dormits, 1 Banhº, circul., Coz., A Serv., varanda, sem vaga.",41.36,"R$ 170.000,00","R$ 151.000,00"]
[25,6,"Bl. 05 e 07 - 214 e 314. Bl. 06 - 212 e 312.\nSala, 2 dormits, 1 Banhº, circul., Coz., A Serv., varanda, com 1 vaga.",41.36,"R$ 190.000,00","R$ 171.000,00"]
[26,8,"Bl. 02 -  214, 314 e 414. Bl. 03 -  212, 312 e 412. Bl.s 04 - 214 e 314.\nSala, 2 dormits, 1 Banhº, circul., Coz., A Serv., varanda, com 1 vaga.",41.36,"R$ 190.000,00","R$ 171.000,00"]
[27,3,"Bl. 01 - 212, 312 e 412.\nSala, 2 dormits, 1 Banhº, circul., Coz., A Serv., varanda, com 1 vaga.",41.36,"R$ 190.000,00","R$ 171.000,00"]
[28,1,"Bl. 01 - 112\nSala, 2 dormits, 1 Banhº, circul., Coz., A Serv., varanda, com 1 vaga.",41.36,"R$ 190.000,00","R$ 171.000,00"]
[29,47,"Bl. 02 - 104, 112, 411, 503, 504, 511 e 512. Bl. 04 - 103, 104, 111, 112, 403, 503, 404,\n504, 411, 511, 412 e 512. Bl. 05 e 07 - 103, 104, 112, 403, 503, 404, 504, 411, 511,\n412 e 512. Bl. 06 - 109, 110, 409, 509, 410 e 510.\nSala, 2 dormits, 1 Banhº, circul., Coz., A Serv., varanda, sem vaga.",41.43,"R$ 170.000,00","R$ 151.000,00"]
[30,4,"Bl. 06 - 209, 309, 210 e 310.\nSala, 2 dormits, 1 Banhº, circul., Coz., A Serv., varanda, com 1 vaga.",41.43,"R$ 190.000,00","R$ 171.000,00"]
[31,38,"Bl. 02 - 111, 203, 303, 204, 304, 211, 311, 212, 312, 403, 404 e 412. Bl. 04 - 203, 303,\n204, 304, 211, 311, 212 e 312. Bl. 05 e 07 - 111, 203, 303, 204, 304, 211, 311, 212 e\n312.\nSala, 2 dormits, 1 Banhº, circul., Coz., A Serv., varanda, com 1 vaga.",41.43,"R$ 190.000,00","R$ 172.000,00"]
[32,1,"Bl. 02 - 103.\nSala, 2 dormits, 1 Banhº, circul., Coz., A Serv., varanda, com 1 vaga.",41.43,"R$ 190.000,00","R$ 171.000,00"]
[33,16,"Bl. 01 - 503, 504, 509 e 510. Bl. 03  - 409, 410, 503, 504, 509 e 510. Bl. 06  -  102, 103,\n402, 502, 403 e 503.",41.53,"R$ 170.000,00","R$ 151.000,00"]
[34,4,"Bl. 06 - 202, 302, 203 e 303.\nSala, 2 dormits, 1 Banhº, circul., Coz., A Serv., varanda, com 1 vaga.",41.53,"R$ 190.000,00","R$ 172.000,00"]
[35,10,"Bl. 03 - 203, 303, 204, 304, 209, 309, 210, 310, 403 e 404.\nSala, 2 dormits, 1 Banhº, circul., Coz., A Serv., varanda, com 1 vaga.",41.53,"R$ 190.000,00","R$ 172.000,00"]
[36,4,"Bl. 03 - 103, 104, 109 e 110.\nSala, 2 dormits, 1 Banhº, circul., Coz., A Serv., varanda, com 1 vaga.",41.53,"R$ 190.000,00","R$ 172.000,00"]
[37,12,"Bl. 01 - 203, 303, 403, 204, 304, 404, 209, 309, 409, 210, 310 e 410.\nSala, 2 dormits, 1 Banhº, circul., Coz., A Serv., varanda, com 1 vaga.",41.53,"R$ 190.000,00","R$ 172.000,00"]
[38,4,"Bl. 01 - 103, 104, 109 e 110.\nSala, 2 dormits, 1 Banhº, circul., Coz., A Serv., varanda, com 1 vaga.",41.53,"R$ 190.000,00","R$ 172.000,00"]
[39,6,"Bl. 01 - 505. Bl. 03 - 405 e 505. Bl. 06 - 104, 404 e 504.\nSala, 2 dormits, 1 Banhº, circul., Coz., A Serv., varanda, sem vaga.",42.6,"R$ 170.000,00","R$ 154.000,00"]
[40,2,"Bl. 06 - 204 e 304.\nSala, 2 dormits, 1 Banhº, circul., Coz., A Serv., varanda, com 1 vaga.",42.6,"R$ 190.000,00","R$ 175.000,00"]
[41,2,"Bl. 03 - 205 e 305.\nSala, 2 dormits, 1 Banhº, circul., Coz., A Serv., varanda, com 1 vaga.",42.6,"R$ 190.000,00","R$ 175.000,00"]
[42,1,"Bl. 03 - 105.\nSala, 2 dormits, 1 Banhº, circul., Coz., A Serv., varanda, com 1 vaga.",42.6,"R$ 190.000,00","R$ 175.000,00"]
[43,3,"Bl. 01 - 205, 305 e 405.\nSala, 2 dormits, 1 Banhº, circul., Coz., A Serv., varanda, com 1 vaga.",42.6,"R$ 190.000,00","R$ 175.000,00"]
[44,1,"Bl. 01 - 105.\nSala, 2 dormits, 1 Banhº, circul., Coz., A Serv., varanda, com 1 vaga.",42.6,"R$ 190.000,00","R$ 175.000,00"]
[45,2,"Bl. 06 - 401 e 501.\nSala, 2 dormits, 1 Banhº, circul., Coz., A Serv., varanda, sem vaga.",42.69,"R$ 170.000,00","R$ 154.000,00"]
[46,2,"Bl. 06 - 201 e 301.\nSala, 2 dormits, 1 Banhº, circul., Coz., A Serv., varanda, com 1 vaga.",42.69,"R$ 190.000,00","R$ 175.000,00"]
[47,1,"Bl. 06 - 101.\nSala, 2 dormits, 1 Banhº, circul., Coz., A Serv., varanda, com 1 vaga.",42.69,"R$ 190.000,00","R$ 175.000,00"]
[48,3,"Bl. 01 - 508.  Bl. 03 - 408 e 508,\nSala, 2 dormits, 1 Banhº, circul., Coz., A Serv., varanda, sem vaga.",42.9,"R$ 170.000,00","R$ 154.000,00"]
[49,2,"Bl. 03 - 208 e 308.\nSala, 2 dormits, 1 Banhº, circul., Coz., A Serv., varanda, com 1 vaga.",42.9,"R$ 190.000,00","R$ 175.000,00"]
[50,1,"Bl. 03 - 108.\nSala, 2 dormits, 1 Banhº, circul., Coz., A Serv., varanda, com 1 vaga.",42.9,"R$ 190.000,00","R$ 175.000,00"]
[51,3,"Bl. 01 - 208, 308 e 408.\nSala, 2 dormits, 1 Banhº, circul., Coz., A Serv., varanda, com 1 vaga.",42.9,"R$ 190.000,00","R$ 175.000,00"]
[52,1,"Bl. 01 - 108.\nSala, 2 dormits, 1 Banhº, circul., Coz., A Serv., varanda, com 1 vaga.",42.9,"R$ 190.000,00","R$ 175.000,00"]
[53,2,"Bl. 01 e 03  - 502.\nSala, 2 dormits, 1 Banhº, circul., Coz., A Serv., varanda, sem vaga.",43.56,"R$ 170.000,00","R$ 156.000,00"]
[54,3,"Bl. 03 - 202, 302 e 402.\nSala, 2 dormits, 1 Banhº, circul., Coz., A Serv., varanda, com 1 vaga.",43.56,"R$ 190.000,00","R$ 177.000,00"]
[55,3,"Bl. 01 - 202, 302 e 402.\nSala, 2 dormits, 1 Banhº, circul., Coz., A Serv., varanda, com 1 vaga.",43.56,"R$ 190.000,00","R$ 177.000,00"]
[56,1,"Bl. 01 - 102.\nSala, 2 dormits, 1 Banhº, circul., Coz., A Serv., varanda, com 1 vaga.",43.56,"R$ 190.000,00","R$ 177.000,00"]
[57,2,"Bl. 01 e 03 - 511.\nSala, 2 dormits, 1 Banhº, circul., Coz., A Serv., varanda, sem vaga.",43.75,"R$ 170.000,00","R$ 156.000,00"]
[58,3,"Bl. 03 - 211, 311 e 411.\nSala, 2 dormits, 1 Banhº, circul., Coz., A Serv., varanda, com 1 vaga.",43.75,"R$ 190.000,00","R$ 178.000,00"]
[59,3,"Bl. 01 - 211, 311 e 411..\nSala, 2 dormits, 1 Banhº, circul., Coz., A Serv., varanda, com 1 vaga.",43.75,"R$ 190.000,00","R$ 178.000,00"]
[60,13,"Bl. 01 - 506.  Bl. 02, 04, 05 e 07 - 407 e 507. Bl. 03 - 406 e 506. Bl. 06  - 405 e 505.\nSala, 2 dormits, 1 Banhº, circul., Coz., A Serv., varanda, sem vaga.",44.03,"R$ 170.000,00","R$ 157.000,00"]
[61,16,"Bl. 02 - 107, 207 e 307.  Bl. 03 - 206 e 306.  Bl. 04, 05 e 07 - 107, 207 e 307.  Bl. 06 -\n205 e 305.",44.03,"R$ 190.000,00","R$ 178.000,00"]
[62,1,"Bl. 03 - 106.\nSala, 2 dormits, 1 Banhº, circul., Coz., A Serv., varanda, com 1 vaga.",44.03,"R$ 190.000,00","R$ 178.000,00"]
[63,3,"Bl. 01 - 206, 306 e 406.\nSala, 2 dormits, 1 Banhº, circul., Coz., A Serv., varanda, com 1 vaga.",44.03,"R$ 190.000,00","R$ 178.000,00"]
[64,1,"Bl. 06 - 105.\nSala, 2 dormits, 1 Banhº, circul., Coz., A Serv., varanda, com 1 vaga.",44.03,"R$ 190.000,00","R$ 178.000,00"]
[65,1,"Bl. 01 - 106.\nSala, 2 dormits, 1 Banhº, circul., Coz., A Serv., varanda, com 1 vaga.",44.03,"R$ 190.000,00","R$ 178.000,00"]
[66,13,"Bl. 01 - 507.  Bl. 02, 04, 05 e 07 - 408 e 508.  Bl. 03 - 407 e 507.  Bl. 06 - 406 e 506.\nSala, 2 dormits, 1 Banhº, circul., Coz., A Serv., varanda, sem vaga.",44.33,"R$ 170.000,00","R$ 158.000,00"]
[67,16,"Bl. 02, 04, 05 e 07 - 108, 208 e 308.  Bl. 03 - 207 e 307. Bl. 06 - 206 e 306.\nSala, 2 dormits, 1 Banhº, circul., Coz., A Serv., varanda, com 1 vaga.",44.33,"R$ 190.000,00","R$ 179.000,00"]
[68,1,"Bl. 03 - 107.\nSala, 2 dormits, 1 Banhº, circul., Coz., A Serv., varanda, com 1 vaga.",44.33,"R$ 190.000,00","R$ 179.000,00"]
[69,3,"Bl. 01 - 207, 307 e 407.\nSala, 2 dormits, 1 Banhº, circul., Coz., A Serv., varanda, com 1 vaga.",44.33,"R$ 190.000,00","R$ 179.000,00"]
[70,1,"Bl. 06 - 106.\nSala, 2 dormits, 1 Banhº, circul., Coz., A Serv., varanda, com 1 vaga.",44.33,"R$ 190.000,00","R$ 179.000,00"]
[71,1,"Bl. 01 - 107.\nSala, 2 dormits, 1 Banhº, circul., Coz., A Serv., varanda, com 1 vaga.",44.33,"R$ 190.000,00","R$ 179.000,00"]
[null,500,null,20857.57,90770000,81840000]

{"sheet":"Plan1","index":8,"n_rows":0,"n_cols":0,"rows_kept":0,"cut":false,"hidden":true,"merged":[]}

{"sheet":"Plan2","index":9,"n_rows":0,"n_cols":0,"rows_kept":0,"cut":false,"hidden":true,"merged":[]}

{"sheet":"Plan3","index":10,"n_rows":33,"n_cols":5,"rows_kept":33,"cut":false,"hidden":true,"merged":[]}
["2018-03-01",0,"ATO"]
["2018-04-01",1,30]
["2018-05-01",2,60]
["2018-06-01",3,90]
["2018-07-01",4,"MENSAL",1]
["2018-08-01",5,null,2]
["2018-09-01",6,null,3]
["2018-10-01",7,null,4]
["2018-11-01",8,null,5]
["2018-12-01",9,null,6]
["2019-01-01",10,null,7]
["2019-02-01",11,null,8]
["2019-03-01",12,null,9]
["2019-04-01",13,null,10]
["2019-05-01",14,null,null,1]
["2019-06-01",15,null,null,2]
["2019-07-01",16,null,null,3]
["2019-08-01",17,null,null,4]
["2019-09-01",18,null,null,5]
["2019-10-01",19,null,null,6]
["2019-11-01",20,null,null,7]
["2019-12-01",21,null,null,8]
["2020-01-01",22,null,1]
["2020-02-01",23,null,2]
["2020-03-01",24,null,3]
["2020-04-01",25,null,4]
["2020-05-01",26,null,5]
["2020-06-01",27,null,6]
["2020-07-01",28,null,null,1]
["2020-08-01",29,null,null,2]
["2020-09-01",30,null,null,3]
["2020-10-01",31,null,null,4]
["2020-11-01",32,null,null,5]

{"sheet":"Plan4","index":11,"n_rows":16,"n_cols":2,"rows_kept":16,"cut":false,"hidden":true,"merged":[]}
[]
[]
[null,"Valores de cartório:"]
[]
[null,"Preços do cartório (São Gonçalo):"]
[]
[null,"Valor de Registro : 2.400,00"]
[]
[null,"Regras (ITBI)"]
[]
[null,"Valor ITBI Fixo : 500,00"]
[]
[null,"Taxa à Vista Repasse"]
[]
[null,"MCMV : R$ 600,00"]
[null,"SBPE : R$ 3.100,00"]